program: Gaussian 09
title: 000161885
version: EM64L-G09RevD.01
frameworkgroup: C1[X(C20H32O5)]
method: RPBEPBE
basis: SDD
operation: Freq
keyword: #pfreq=noraman
keyword: PBEPBE/SDD
title: #p freq=noraman PBEPBE/SDD
converged: YES YES NO NO
title: Mulliken charges:
elementType: O O O O O C C C C C C C C C C C C C C C C C C C C H H H H H H H H H H H H H H H H H H H H H H H H H H H H H H H H
charge: -0.463883 -0.468842 -0.232910 -0.428897 -0.242165 -0.104570 -0.212352 -0.131806 -0.175559 -0.534514 -0.507463 -0.167706 -0.189178 -0.346414 -0.169226 0.179985 -0.485289 -0.532456 -0.368584 -0.384849 -0.338826 -0.496070 -0.356734 -0.696381 0.202988 0.233214 0.263353 0.280938 0.245396 0.214621 0.253345 0.204849 0.220089 0.286659 0.348378 0.351703 0.224376 0.230850 0.225791 0.203523 0.231173 0.232501 0.232786 0.214786 0.210411 0.204517 0.224927 0.182219 0.181624 0.244811 0.306022 0.197142 0.197175 0.208839 0.216879 0.208736 0.370070
chargesum: 0.00000
title: Mulliken charges with hydrogens summed into heavy atoms:
elementType: O O O O O C C C C C C C C C C C C C C C C C C C C
charge: -0.115505 -0.117139 -0.232910 -0.058827 -0.242165 0.128644 0.051001 0.149132 0.069837 -0.066548 -0.082525 0.118953 0.035197 -0.115564 0.056564 0.179985 -0.050593 -0.067169 0.056612 0.044596 0.025017 0.054763 0.037584 -0.061927 0.202988
polarizability: 3.18273532e+02 3.81419092e+00 2.07110954e+02 -1.10580279e+01 4.23205682e+00 2.00417882e+02
1716.lowfreq: -15.0575 -11.3621 -8.1355 -3.4847 -0.0010 -0.0009 0.0018 4.7996 9.2823
frequency: -12.0384 -9.1710 8.3169 22.2159 28.9247 36.1155 39.9805 46.0118 56.1863 56.6502 63.0674 88.4464 102.1839 112.2817 115.0996 149.1685 154.9184 161.9500 176.5715 194.8189 206.9922 216.2462 234.4781 241.0977 259.0824 285.4290 307.0774 322.1440 333.5722 334.1548 367.6486 385.8256 393.9019 415.2775 440.4115 445.0985 473.3304 497.3619 502.3121 511.6881 543.5675 575.0145 589.9386 632.8850 647.4275 651.0364 705.1380 717.6825 747.0319 749.0404 755.1420 786.9095 813.0740 819.8965 832.6467 833.6130 867.8437 868.8002 881.6530 889.5157 902.8013 922.3619 938.3436 948.1135 954.6468 968.5401 975.8298 997.1180 1000.1901 1004.9167 1019.9324 1023.1846 1032.7172 1047.1402 1049.6087 1066.4202 1073.7351 1083.2572 1088.7354 1092.1842 1098.7656 1102.4456 1123.0561 1134.8990 1141.1142 1164.7215 1176.8043 1187.4154 1193.7996 1205.7947 1207.8538 1212.3068 1229.6636 1242.4693 1250.8973 1251.3743 1255.5323 1261.8391 1278.3127 1282.9052 1284.9131 1289.5606 1292.5573 1296.2489 1298.8794 1301.3171 1305.7737 1321.3460 1327.3854 1330.6952 1343.4595 1349.5505 1350.3172 1358.5169 1368.0349 1374.0087 1388.4874 1417.4960 1429.0958 1439.5306 1446.6649 1452.6120 1459.3149 1461.8818 1466.9751 1467.2740 1477.5287 1477.9699 1486.5410 1575.9312 1654.2940 1665.8007 1686.9369 2946.0159 2949.9684 2955.0568 2960.3362 2968.7611 2971.1685 2972.0112 2985.0177 2988.3781 2991.5608 2992.2152 2996.2240 2998.5393 3015.9677 3022.1123 3022.4038 3037.1349 3041.1994 3052.2392 3053.9519 3061.6570 3065.7136 3067.9719 3069.0457 3070.8211 3073.7684 3076.2805 3079.6033 3107.0852 3395.5255 3501.4268 3561.8266
redmass: 1.8566 3.2692 5.6225 5.3974 10.0653 6.0325 4.5642 3.9642 4.9208 5.6465 4.4429 3.3282 2.2799 2.5579 2.7390 3.0698 3.6382 2.8765 3.6433 3.8102 3.9650 2.9319 1.1060 4.6827 2.4531 3.7352 4.1381 2.1596 1.4384 2.8927 2.8238 3.1288 2.9663 2.6369 4.0166 2.0759 3.2390 3.2244 2.0841 2.3521 2.3631 2.9182 3.3245 1.1414 1.3922 4.4574 3.2550 1.0980 1.6997 1.3842 3.8677 2.4389 2.0837 2.6671 2.3937 1.6326 2.5658 2.2999 2.1885 2.5548 2.1694 2.3707 2.9238 2.0232 1.3068 1.1410 1.9520 2.5116 3.3329 1.3417 1.9296 2.6257 2.6038 2.4918 2.0731 2.1450 2.0193 1.9123 2.0077 1.5689 1.8658 2.0435 2.6928 1.8021 1.6931 1.4518 1.2147 1.3254 1.5889 1.3227 1.3789 1.3472 1.2830 1.3680 1.2638 1.5966 1.2494 1.3594 1.3595 1.0665 1.3519 1.1136 1.3360 1.3737 1.3916 1.4090 1.3919 1.4165 1.3563 1.4536 1.3832 1.6053 1.4565 1.7056 1.5765 1.5923 1.2183 1.1565 1.0994 1.1015 1.0987 1.0983 1.0845 1.0701 1.0757 1.0993 1.0709 1.0426 1.0818 8.6179 6.3215 7.7990 6.6018 1.0602 1.0589 1.0807 1.0668 1.0573 1.0381 1.0626 1.0629 1.0950 1.0990 1.0614 1.0660 1.0636 1.0839 1.0855 1.1028 1.0966 1.0932 1.0989 1.1030 1.0943 1.0975 1.1009 1.1013 1.0992 1.0898 1.0896 1.0897 1.0910 1.0660 1.0637 1.0660
irintensity: 0.3979 0.1733 0.3629 0.3277 1.0958 0.0899 0.1726 0.3234 3.2328 3.3241 3.0148 1.1633 0.6094 0.7191 0.7870 0.2660 0.3317 0.2594 0.6027 5.7347 1.6871 1.7725 0.0117 5.7610 3.3838 1.8562 5.2350 25.4479 50.3300 18.0273 56.4965 5.5529 2.8178 10.1277 25.1294 1.8103 9.2085 2.3992 33.3273 2.7256 0.4491 8.6474 9.3815 92.0935 145.2874 19.8456 4.8311 12.6640 4.6335 1.5793 6.4324 3.0540 10.8831 17.8205 9.6570 8.7164 5.8471 6.6494 3.7607 16.1235 5.5994 5.6075 55.9761 29.8105 1.1872 35.2580 42.9225 6.9203 48.3638 24.9298 34.5636 27.2794 143.5807 61.8679 15.7203 17.3771 2.6851 31.0896 29.7050 6.5174 10.7716 26.9792 32.8099 18.4477 2.8551 15.9936 10.8196 7.8732 0.2655 18.1041 24.4768 6.2801 14.1407 41.3258 0.4775 2.1296 5.7161 27.9515 5.6226 0.4181 10.5438 1.0935 5.3577 6.9068 3.5219 2.1052 25.0012 16.5741 19.0504 14.9109 3.7386 17.8927 7.7477 16.6015 28.7300 18.1896 10.3157 51.6929 20.7071 31.8157 21.6996 7.3004 14.7389 0.5387 0.9595 16.1300 6.8029 12.4837 18.0099 202.3707 167.7062 199.3222 1.2947 18.8664 28.3720 19.2472 30.5284 55.2482 32.1266 33.8572 19.6446 13.7229 0.4068 30.8495 13.4832 48.0783 57.9931 6.0422 14.0663 20.7861 4.8057 13.2951 37.3087 15.0428 5.6542 107.1039 28.0622 53.7300 2.8030 45.2494 26.8026 13.0354 86.7026 15.5989 6.8681
temp: 298.150 k
press: 1.00000 atm
elementType: 8 8 8 8 8 6 6 6 6 6 6 6 6 6 6 6 6 6 6 6 6 6 6 6 6 1 1 1 1 1 1 1 1 1 1 1 1 1 1 1 1 1 1 1 1 1 1 1 1 1 1 1 1 1 1 1 1
symmnumber: 1
zpe: 1271531.9 jmol-1
zpe.correction: 0.484301 hartree
zpe.thermalcorrener: 0.511487 hartree
zpe.thermalcorrenthalpy: 0.512432 hartree
zpe.thermalcorrgfe: 0.422474 hartree
zpe.sumelectzpe: -1155.441836 hartree
zpe.sumelectthermal: -1155.414650 hartree
zpe.sumelectthermalent: -1155.413706 hartree
zpe.sumelectthermalfe: -1155.503664 hartree
dipole: -0.7111 3.3937 -1.3439
dipole: 3.7188
quadrupole: -161.2178 -145.2858 -153.1711
quadrupole: 10.3248 7.8438 5.7114
quadrupole: -7.9929 7.9391 0.0538 10.3248 7.8438 5.7114
hfenergy: -1155.9261372 hartree
pointgroup: C01 [X(C20H32O5)]
dipole: -0.3112099 -1.24513 0.7024046 debye
polarizability: 317.9147157|-4.4978494|208.261486|12.6342863|2.9035751|199.6261662 unknown
InChI: InChI=1S/C20H32O5/c1-2-3-6-9-15(21)12-13-17-16(18(22)14-19(17)23)10-7-4-5-8-11-20(24)25/h4,7,12-13,16-19,22-24H,2-3,5-6,8-11,14H2,1H3
charge 0 multiplicity 1
57 atoms
O  2.977518 -1.742153 1.256706
O  0.749052 -3.445322 1.687201
O  -3.744382 -0.468057 -1.717175
O  5.03901 -0.219774 -2.139293
O  5.908068 1.927448 -2.079779
C  1.038933 -0.519788 0.187671
C  -0.157147 -1.464942 0.611298
C  2.263041 -1.472244 -0.000928
C  0.353488 -2.918598 0.344236
C  1.601709 -2.757763 -0.553313
C  1.263111 0.653221 1.172476
C  -1.412185 -1.137143 -0.149672
C  2.367058 1.585105 0.71757
C  -2.564788 -0.643052 0.386631
C  3.510328 1.815005 1.413794
C  -3.751819 -0.312693 -0.458489
C  4.675743 2.655373 0.938539
C  -4.979618 0.21789 0.285421
C  -6.156376 0.604366 -0.626678
C  5.994018 1.83014 0.86432
C  -7.387775 1.097038 0.165023
C  5.876694 0.56029 -0.00746
C  -8.56745 1.50382 -0.747271
C  -9.803478 1.984369 0.043321
C  5.63036 0.871508 -1.468968
H  0.812456 -0.095795 -0.814402
H  -0.342368 -1.376851 1.697761
H  3.021141 -1.044155 -0.674997
H  -0.42681 -3.575502 -0.085152
H  1.28702 -2.600508 -1.603478
H  2.278752 -3.629768 -0.523427
H  0.304839 1.206205 1.271125
H  1.515577 0.242164 2.167313
H  -1.394831 -1.278827 -1.243114
H  2.385165 -2.333573 1.803597
H  0.990298 -4.402755 1.601439
H  2.227253 2.074673 -0.260959
H  -2.650104 -0.475107 1.469418
H  3.643956 1.304553 2.381369
H  4.846659 3.50448 1.631663
H  4.455905 3.091408 -0.053964
H  -4.660246 1.083867 0.904541
H  -5.292108 -0.558479 1.0180
H  -6.431825 -0.265656 -1.253145
H  -5.824118 1.388173 -1.334833
H  6.286114 1.515302 1.885161
H  6.801207 2.477626 0.474176
H  -7.102971 1.963482 0.798931
H  -7.72525 0.300506 0.861836
H  6.819319 -0.022472 0.041497
H  5.079456 -0.109267 0.360554
H  -8.846469 0.64149 -1.386353
H  -8.233256 2.305194 -1.437241
H  -9.555648 2.860473 0.672305
H  -10.62841 2.276389 -0.632284
H  -10.180939 1.188076 0.71267
H  4.944122 0.013911 -3.103488
