program: Gaussian 09
title: 000161883
version: EM64L-G09RevD.01
frameworkgroup: C1[X(C15H14N2O2)]
method: RPBEPBE
basis: SDD
operation: Freq
keyword: #p
keyword: freq=noraman
keyword: PBEPBE/SDD
title: #p freq=noraman PBEPBE/SDD
converged: YES YES NO NO
title: Mulliken charges:
elementType: O O N N C C C C C C C C C C C C C C C H H H H H H H H H H H H H H
charge: -0.292941 -0.287967 -0.374125 -0.514777 -0.465153 0.336901 0.341643 0.164917 0.164799 -0.254958 -0.449633 -0.449213 -0.397428 -0.397630 -0.242324 -0.242340 -0.235836 -0.236180 0.295966 0.248435 0.239500 0.230962 0.240553 0.239270 0.239578 0.239596 0.226126 0.225894 0.226220 0.226206 0.345072 0.304453 0.304413
chargesum: 0.00000
title: Mulliken charges with hydrogens summed into heavy atoms:
elementType: O O N N C C C C C C C C C C C C C C C
charge: -0.292941 -0.287967 -0.029053 0.094090 -0.216717 0.336901 0.341643 0.164917 0.164799 0.215504 -0.209080 -0.209943 -0.157851 -0.158034 -0.016198 -0.016446 -0.009616 -0.009974 0.295966
polarizability: 1.63495254e+02 1.14993072e+01 2.32378440e+02 -3.42948333e+01 3.18732983e+00 1.45728779e+02
1716.lowfreq: -16.5928 -7.4017 -6.2738 -1.6882 -0.0005 -0.0002 0.0009 31.2064 35.3001
frequency: -16.2257 31.2016 35.2705 87.3637 97.4199 130.1470 139.0232 166.9347 193.1619 218.8147 219.2658 231.6861 277.0033 295.1843 408.6776 410.4323 435.7531 445.5930 469.1529 508.9080 556.2480 559.7710 572.8105 588.5253 618.1638 645.9702 709.3074 711.1639 719.8824 731.6277 745.4139 750.6358 771.1443 786.0441 794.3753 822.6308 875.2019 877.5153 920.8606 946.4811 951.4320 972.4104 984.2947 986.3037 996.4617 1002.9453 1021.8909 1034.8934 1043.7264 1105.7819 1111.1708 1151.2932 1164.7246 1170.7388 1171.2152 1183.2921 1186.9679 1237.6167 1242.0813 1251.4791 1270.6331 1283.2322 1303.5775 1305.7116 1359.2897 1379.4239 1403.1619 1439.6034 1445.0528 1450.4107 1469.4966 1478.1392 1484.7080 1592.9646 1593.7563 1619.9962 1622.6498 1656.8201 1681.8804 2957.6745 3001.9703 3062.4421 3118.3354 3119.1292 3126.1986 3127.8265 3140.7962 3142.0363 3160.4847 3161.3794 3412.4601 3533.2298 3570.6147
redmass: 5.8958 5.6368 5.2388 4.4533 5.7747 5.5107 3.7621 5.6830 5.3954 1.4026 3.5676 1.7837 5.0458 3.7326 5.5029 3.5146 4.2683 2.9489 5.4780 4.8533 4.6738 3.8941 3.5204 1.1809 6.8705 5.2316 2.7912 6.0316 4.2755 2.3006 1.6118 1.3687 4.4582 2.7585 2.4547 3.6152 1.4767 1.4695 3.2255 1.4353 1.6739 5.4322 1.3341 1.3227 6.6636 2.1235 2.3031 1.8015 3.6840 1.8159 1.6581 4.6446 1.2329 1.0976 1.1800 1.5258 1.7114 1.3817 1.8361 2.6011 2.4939 1.1587 1.5582 1.9600 1.2875 8.4162 3.8411 2.2383 2.7051 1.6502 2.6709 1.1265 3.7953 6.4553 7.2013 7.3833 7.0940 5.2839 1.1715 1.0800 1.0584 1.1071 1.0867 1.0866 1.0886 1.0887 1.0941 1.0942 1.1002 1.1002 1.0422 1.1008 1.0791
irintensity: 0.3676 0.7171 0.1555 0.5665 2.0101 2.4428 0.5861 0.0930 0.9787 8.2566 1.3996 12.6737 37.0758 0.5316 0.3737 3.9076 1.7069 0.1882 3.4300 0.1292 13.3012 0.9231 0.0185 170.6832 9.6624 2.3856 80.8393 0.1850 8.4141 94.7504 0.5661 154.9294 8.9456 0.4457 0.0140 1.0264 0.9181 0.0493 4.1111 0.0508 4.5509 84.5618 0.0204 0.2994 3.6960 5.4909 1.7703 5.3820 48.0101 7.4099 0.1289 346.7043 1.0301 1.8473 4.3988 3.4616 9.1196 0.5122 3.6550 88.7139 0.4997 0.0631 0.5916 0.8629 7.9742 9.8149 0.9602 25.5981 13.2123 211.7244 10.3110 17.1630 3.7441 0.5497 0.1987 3.3203 0.3042 297.9502 0.2372 5.8955 36.6229 18.3745 3.2955 9.8112 4.4433 2.9163 8.0641 45.9417 59.5527 13.8470 0.4353 2.2257 35.8102
temp: 298.150 k
press: 1.00000 atm
elementType: 8 8 7 7 6 6 6 6 6 6 6 6 6 6 6 6 6 6 6 1 1 1 1 1 1 1 1 1 1 1 1 1 1
symmnumber: 1
zpe: 681575.8 jmol-1
zpe.correction: 0.259599 hartree
zpe.thermalcorrener: 0.275065 hartree
zpe.thermalcorrenthalpy: 0.276009 hartree
zpe.thermalcorrgfe: 0.215986 hartree
zpe.sumelectzpe: -838.600000 hartree
zpe.sumelectthermal: -838.584534 hartree
zpe.sumelectthermalent: -838.583590 hartree
zpe.sumelectthermalfe: -838.643613 hartree
dipole: -0.8809 -0.0447 0.3222
dipole: 0.9391
quadrupole: -111.2425 -98.0105 -106.9801
quadrupole: 1.0199 -1.8672 0.9768
quadrupole: -5.8315 7.4005 -1.5690 1.0199 -1.8672 0.9768
hfenergy: -838.8595987 hartree
pointgroup: C01 [X(C15H14N2O2)]
dipole: 0.3451997 -0.0673633 -0.1131278 debye
polarizability: 163.9119967|-3.4208807|234.1548327|-33.7186064|-2.1176639|143.5356443 unknown
InChI: InChI=1S/C15H14N2O2/c16-17-15(18)19-9-14-12-7-3-1-5-10(12)11-6-2-4-8-13(11)14/h1-8,14,17H,9,16H2
charge 0 multiplicity 1
33 atoms
O  -1.791751 -0.035626 0.033569
O  -3.994743 0.385592 0.783531
N  -3.461457 0.115767 -1.493821
N  -4.76702 0.300724 -1.997519
C  0.212711 -0.030815 1.419565
C  0.862824 1.136721 0.672257
C  0.83197 -1.249476 0.72947
C  1.764479 0.645712 -0.318146
C  1.745785 -0.829929 -0.282341
C  -1.32411 -0.006445 1.437187
C  0.682294 2.517217 0.855267
C  0.617807 -2.6145 0.979828
C  2.492672 1.542622 -1.130015
C  2.452145 -1.783323 -1.047837
C  1.41078 3.418665 0.037965
C  1.324352 -3.572718 0.209199
C  2.308628 2.93315 -0.945149
C  2.234172 -3.158167 -0.795108
C  -3.169074 0.175681 -0.141865
H  0.521252 -0.010379 2.487682
H  -1.710416 0.904867 1.929347
H  -1.73393 -0.885273 1.969372
H  -0.010052 2.902139 1.613501
H  -0.083673 -2.944506 1.755365
H  3.189132 1.174662 -1.891942
H  3.158059 -1.470816 -1.82568
H  1.280341 4.498891 0.16717
H  1.167651 -4.641767 0.39133
H  2.864852 3.643569 -1.567103
H  2.773296 -3.91166 -1.380346
H  -2.715242 -0.050523 -2.168999
H  -5.406854 -0.435189 -1.67229
H  -5.127378 1.239235 -1.782543
