program: Gaussian 09
title: 000161878
version: EM64L-G09RevD.01
frameworkgroup: C1[X(C10H12ClN2O3PS2)]
method: RPBEPBE
basis: SDD
operation: Freq
keyword: #p
keyword: freq=noraman
keyword: PBEPBE/SDD
title: #p freq=noraman PBEPBE/SDD
converged: NO YES NO NO
title: Mulliken charges:
elementType: Cl S S P O O O N N C C C C C C C C C C H H H H H H H H H H H H
charge: -0.031616 0.027363 -0.253382 0.519540 -0.229118 -0.477173 -0.168873 -0.164192 -0.004278 -0.687381 0.108193 0.258389 0.210407 -0.843582 -0.233977 -0.209104 -0.015227 -0.344824 -0.653462 0.309427 0.322337 0.282942 0.277965 0.304049 0.291771 0.232317 0.224852 0.269459 0.212382 0.232585 0.232211
chargesum: 0.00000
title: Mulliken charges with hydrogens summed into heavy atoms:
elementType: Cl S S P O O O N N C C C C C C C C C C
charge: -0.031616 0.027363 -0.253382 0.519540 -0.229118 -0.477173 -0.168873 -0.164192 -0.004278 -0.055617 0.108193 0.258389 0.210407 0.021374 0.057793 0.248065 -0.015227 -0.075365 0.023716
polarizability: 2.56954515e+02 -1.41815120e+01 2.28725083e+02 -5.15382796e+00 -5.16071097e+00 1.44704885e+02
1716.lowfreq: -7.2316 -2.9024 -0.0019 -0.0012 -0.0011 4.7998 24.9018 31.1609 34.7857
frequency: 24.7639 31.0759 34.7310 42.3873 60.9113 81.8518 100.0294 108.8089 113.3572 147.4520 166.3050 177.9782 190.0387 195.9729 200.9131 222.7313 243.6842 257.1231 279.3931 299.9520 322.2035 346.4807 351.4958 356.1076 392.2211 413.9680 437.4040 517.8277 546.3379 579.3103 589.7482 617.0822 654.2404 667.3034 670.7080 688.7663 712.4579 732.0934 758.1056 812.6071 839.4580 873.4846 875.7708 879.4277 887.3989 926.8017 963.3201 976.3825 1026.3865 1033.1058 1065.4040 1089.2483 1106.6988 1136.8375 1203.4296 1251.5885 1254.7642 1289.3166 1313.5046 1332.8932 1336.0140 1355.0229 1363.2696 1395.8474 1405.2560 1427.2716 1427.8071 1437.0476 1459.0770 1462.2746 1477.2268 1488.6012 1564.7733 1599.7592 1757.7156 2959.8232 2984.9666 2996.2967 3020.0175 3048.7974 3092.7119 3109.2666 3119.4211 3146.5981 3153.2279 3168.8351 3194.9615
redmass: 6.0002 5.5901 6.9837 4.7000 4.4694 2.7162 10.7517 7.6390 5.8643 6.1494 3.9740 5.6240 4.0327 1.0679 5.3554 3.0444 3.6851 2.2863 3.7018 4.6610 5.2416 7.6721 8.5186 7.5840 5.5921 10.9272 4.8084 9.8394 9.7892 4.8416 6.2228 7.6524 9.2346 8.1702 5.5052 8.7900 9.0232 7.7633 7.2036 1.0883 3.7347 3.5985 1.5567 3.9008 1.3665 3.9131 1.2999 1.3409 2.6485 3.8361 1.9285 5.2033 2.1934 1.4321 3.5291 1.5142 1.1388 1.7585 1.6096 1.1601 2.2738 1.2677 4.9259 1.2426 2.3598 1.0694 1.2635 1.0507 1.0401 2.9518 1.0517 1.0777 9.2797 9.0072 12.3698 1.0700 1.0552 1.0371 1.0300 1.1081 1.0982 1.1021 1.0963 1.1029 1.1029 1.0932 1.0954
irintensity: 0.3421 0.2045 0.3943 0.0982 0.1207 2.6092 0.2376 1.6446 9.8542 1.5030 2.2234 0.6619 0.8106 0.3641 1.8708 2.1142 0.6736 1.0858 1.6961 1.7613 2.7836 6.3779 52.8131 10.5774 14.5571 3.9624 0.8501 65.2634 11.8188 22.0099 59.6437 1.8959 23.4972 42.9881 44.3374 26.5666 28.9077 24.3057 8.5281 3.6221 107.3647 96.1792 55.8524 111.7443 0.8699 17.7442 43.1400 92.5674 90.6315 1.9087 18.1348 17.3007 8.5310 5.7896 89.2130 0.3169 0.4276 150.0843 27.2633 14.0285 15.5434 7.7622 77.0417 27.4916 4.9993 1.4900 42.5580 6.4698 13.3882 308.7914 6.1829 12.6208 18.6096 30.9758 659.2793 26.4592 21.8406 27.2457 4.0113 10.8200 24.8854 30.4254 11.1074 0.6008 2.0389 3.4320 1.9413
temp: 298.150 k
press: 1.00000 atm
elementType: 17 16 16 15 8 8 8 7 7 6 6 6 6 6 6 6 6 6 6 1 1 1 1 1 1 1 1 1 1 1 1
symmnumber: 1
zpe: 564775.2 jmol-1
zpe.correction: 0.215112 hartree
zpe.thermalcorrener: 0.235992 hartree
zpe.thermalcorrenthalpy: 0.236936 hartree
zpe.thermalcorrgfe: 0.162724 hartree
zpe.sumelectzpe: -2319.448749 hartree
zpe.sumelectthermal: -2319.427869 hartree
zpe.sumelectthermalent: -2319.426925 hartree
zpe.sumelectthermalfe: -2319.501137 hartree
dipole: -0.9859 -2.7077 -1.1652
dipole: 3.1083
quadrupole: -126.5166 -154.7436 -146.4381
quadrupole: -5.4041 2.7301 6.1157
quadrupole: 16.0495 -12.1775 -3.8720 -5.4041 2.7301 6.1157
hfenergy: -2319.6638608 hartree
pointgroup: C01 [X(C10H12Cl1N2O3P1S2)]
dipole: 0.5575679 -0.8466726 0.6839045 debye
polarizability: 250.9924038|12.1707316|226.9178779|-20.2892798|-21.587672|152.474201 unknown
InChI: InChI=1S/C7H4ClN2O2S.C3H8OPS/c8-4-1-5-6(9-2-4)10(3-13)7(11)12-5;1-3-4-5(2)6/h1-2H,3H2;3H2,1-2H3
charge 0 multiplicity 1
31 atoms
Cl -4.236537 -2.856097 1.578526
S  1.920731 1.360711 0.333458
S  2.572852 -1.405505 -2.042471
P  2.874983 -0.74074 -0.097518
O  -2.855989 1.984718 -0.128583
O  4.514432 -0.41882 0.393882
O  -1.357493 3.602864 -1.024692
N  -0.708633 1.323775 -0.651188
N  -0.899132 -1.038493 0.070037
C  0.675609 1.402762 -1.095613
C  -1.377523 0.202419 -0.124508
C  -2.699057 0.623853 0.181067
C  -1.568078 2.444801 -0.656097
C  2.357457 -1.831142 1.307186
C  -3.626951 -0.271496 0.710512
C  5.392525 0.345923 -0.538491
C  -3.130306 -1.587309 0.902059
C  -1.799567 -1.939213 0.585841
C  6.768458 0.396782 0.1187
H  0.810465 2.361518 -1.616575
H  0.926413 0.554281 -1.763797
H  2.870873 -2.800832 1.217156
H  2.630429 -1.337442 2.252451
H  1.26692 -1.954678 1.235906
H  -4.65186 0.012744 0.957288
H  5.415587 -0.175958 -1.514224
H  4.962652 1.356683 -0.678223
H  -1.439829 -2.959809 0.742716
H  7.468961 0.9563 -0.528308
H  6.717997 0.902865 1.097572
H  7.168209 -0.620364 0.268532
