program: Gaussian 09
title: 000161861
version: EM64L-G09RevD.01
frameworkgroup: C1[X(C11H17NO2)]
method: RPBEPBE
basis: SDD
operation: Freq
keyword: #p
keyword: freq=noraman
keyword: PBEPBE/SDD
title: #p freq=noraman PBEPBE/SDD
converged: YES YES NO NO
title: Mulliken charges:
elementType: O O N C C C C C C C C C C C H H H H H H H H H H H H H H H H H
charge: -0.329214 -0.433448 -0.075767 -0.581108 -0.354946 0.548810 -0.534472 -0.423614 -0.616101 -0.620013 0.226768 -0.324033 0.119701 -0.523092 0.225148 0.209599 0.229140 0.186529 0.243885 0.236969 0.227705 0.186033 0.221288 0.221717 0.183049 0.231297 0.247706 0.377107 0.225922 0.224959 0.242478
chargesum: 0.00000
title: Mulliken charges with hydrogens summed into heavy atoms:
elementType: O O N C C C C C C C C C C C
charge: -0.329214 -0.056342 -0.075767 -0.146362 0.060722 0.548810 -0.290587 -0.186645 0.018924 0.016050 0.226768 -0.076327 0.119701 0.170268
polarizability: 1.77339532e+02 -2.42999571e+00 1.40870556e+02 -1.07198455e+01 3.47427613e-01 8.84141696e+01
1716.lowfreq: -9.7656 -6.9787 -2.8072 -0.0004 -0.0001 0.0005 19.6733 32.8165 58.5065
frequency: 18.9307 32.7724 58.4856 83.3870 91.5746 159.8226 178.8062 192.8979 208.4097 223.0987 242.0106 266.5354 279.6799 323.6286 341.3345 362.5783 420.8712 428.8080 446.8488 485.9891 490.8843 534.4042 551.3922 617.4896 710.0024 721.5284 772.4452 791.6407 810.2985 830.1731 857.3319 911.2800 937.8700 1006.7958 1011.3911 1025.3112 1034.0503 1056.6414 1090.8059 1111.7212 1116.7879 1125.3925 1141.8611 1156.8291 1160.5736 1187.4508 1215.3784 1225.2938 1260.3359 1270.9239 1284.5411 1301.2235 1313.4213 1364.4916 1411.5494 1416.7804 1422.4996 1439.1946 1447.6253 1459.9952 1462.3072 1465.1329 1473.3414 1474.6172 1475.7223 1480.9226 1486.7117 1505.6129 1610.4246 1620.6490 2827.5159 2838.3093 2857.9850 2963.7563 2989.8643 3017.0582 3020.8371 3026.5379 3052.0546 3057.4549 3076.3657 3083.0325 3125.6862 3131.7127 3139.0684 3169.5973 3517.2762
redmass: 3.2295 2.9548 4.5791 3.2755 2.0365 4.3383 3.0612 1.6749 1.5252 1.4845 1.2221 2.0655 3.3238 2.9075 3.5509 3.0110 3.3413 2.4031 2.8892 1.2862 3.1592 4.0925 5.1566 4.4820 4.8983 4.1036 3.3841 1.3999 1.9399 1.8239 1.7639 3.9977 1.3686 3.7677 2.8048 1.5957 1.7444 2.5077 1.2995 1.8356 1.2568 1.4992 1.7015 1.4736 1.6330 1.3825 1.8967 1.8018 2.2562 2.3200 1.4083 1.5653 1.6865 1.3321 3.3201 1.2370 2.1973 1.1608 1.4539 1.0695 1.0579 1.0499 1.0847 1.0842 1.0572 1.0801 1.0656 3.0966 6.6000 6.8936 1.0693 1.0576 1.0582 1.0326 1.0611 1.0720 1.0846 1.0725 1.1042 1.1021 1.1010 1.1005 1.0996 1.0896 1.0907 1.0953 1.0645
irintensity: 0.4333 0.3354 0.2808 6.0671 0.8484 0.6589 2.4855 0.2039 0.9459 0.2975 0.5284 0.2876 5.3051 5.7918 3.3141 6.4464 0.5480 0.6317 16.8167 108.9351 26.0753 12.5403 18.5954 20.7694 4.9725 8.5916 21.5006 0.7189 21.5506 15.2065 31.4529 6.2451 0.0866 40.8056 9.2134 11.4643 21.0475 58.2336 7.7945 33.7858 0.2031 38.0998 15.4492 26.1149 30.8010 190.2817 30.8969 7.3406 6.5339 88.2651 3.4954 12.4781 42.2197 8.7326 16.4631 6.1298 26.6224 4.4365 14.7891 9.1566 17.6251 14.3662 13.4065 77.7400 3.0688 9.2671 22.1103 135.6187 10.4317 14.3224 66.3881 77.9250 218.6684 55.3742 23.9003 44.3869 34.0932 38.6056 45.7704 26.6171 33.2779 52.2464 25.9324 10.8165 11.0399 7.4702 75.8453
temp: 298.150 k
press: 1.00000 atm
elementType: 8 8 7 6 6 6 6 6 6 6 6 6 6 6 1 1 1 1 1 1 1 1 1 1 1 1 1 1 1 1 1
symmnumber: 1
zpe: 684213.9 jmol-1
zpe.correction: 0.260603 hartree
zpe.thermalcorrener: 0.275987 hartree
zpe.thermalcorrenthalpy: 0.276931 hartree
zpe.thermalcorrgfe: 0.216679 hartree
zpe.sumelectzpe: -633.442825 hartree
zpe.sumelectthermal: -633.427442 hartree
zpe.sumelectthermalent: -633.426498 hartree
zpe.sumelectthermalfe: -633.486750 hartree
dipole: 1.2500 3.7958 0.3532
dipole: 4.0119
quadrupole: -86.4147 -76.2892 -87.6971
quadrupole: -8.2569 1.7129 -0.3864
quadrupole: -2.9477 7.1778 -4.2301 -8.2569 1.7129 -0.3864
hfenergy: -633.7034287 hartree
pointgroup: C01 [X(C11H17N1O2)]
dipole: 0.5326932 1.4854893 0.0306146 debye
polarizability: 176.9693577|-4.1866668|140.8648507|-11.2978211|-2.9748393|88.7900485 unknown
InChI: InChI=1S/C11H17NO2/c1-12(2)7-6-9-4-5-10(13)11(8-9)14-3/h4-5,8,13H,6-7H2,1-3H3
charge 0 multiplicity 1
31 atoms
O  -3.014405 1.545999 0.230337
O  -3.958888 -0.926625 0.622837
N  3.90705 -0.093643 0.050033
C  1.570377 -0.306152 -0.901859
C  2.45767 -0.104505 0.355849
C  0.103218 -0.471295 -0.53389
C  -0.727004 0.669979 -0.358245
C  -0.452217 -1.755367 -0.314305
C  4.730372 -0.287033 1.261598
C  4.33649 1.092281 -0.717051
C  -2.071389 0.512057 0.02573
C  -1.80347 -1.916523 0.072882
C  -2.617543 -0.784511 0.245421
C  -2.570295 2.921957 0.01538
H  1.943697 -1.201233 -1.432345
H  1.69209 0.554423 -1.587029
H  2.26519 -0.944664 1.049633
H  2.134241 0.830857 0.886018
H  -0.310305 1.668288 -0.532618
H  0.175975 -2.642985 -0.452549
H  4.437326 -1.225715 1.764556
H  4.637067 0.546734 2.004576
H  5.79528 -0.369782 0.977964
H  5.416675 1.017153 -0.936022
H  4.160289 2.055939 -0.171138
H  3.803415 1.142318 -1.681679
H  -2.238514 -2.906672 0.237995
H  -4.360198 -0.019301 0.685627
H  -2.240072 3.073162 -1.030473
H  -1.747612 3.186277 0.707565
H  -3.448109 3.551279 0.223302
