program: Gaussian 09
title: 000161859
version: EM64L-G09RevD.01
frameworkgroup: C1[X(C10H18O2)]
method: RPBEPBE
basis: SDD
operation: Freq
keyword: #pfreq=noraman
keyword: PBEPBE/SDD
title: #p freq=noraman PBEPBE/SDD
converged: YES YES NO NO
title: Mulliken charges:
elementType: O O C C C C C C C C C C H H H H H H H H H H H H H H H H H H
charge: -0.299307 -0.267825 -0.040515 -0.431422 0.048866 -0.707099 -0.695385 -0.725570 0.258655 -0.344808 -0.074678 -0.734308 0.190891 0.225728 0.190056 0.235960 0.212728 0.209819 0.214992 0.218618 0.203821 0.223595 0.222772 0.243200 0.213181 0.255966 0.252430 0.234099 0.231594 0.233947
chargesum: 0.00000
title: Mulliken charges with hydrogens summed into heavy atoms:
elementType: O O C C C C C C C C C C
charge: -0.299307 -0.267825 0.150376 -0.015639 0.284826 -0.069560 -0.049351 -0.046417 0.258655 -0.088843 0.177752 -0.034667
polarizability: 1.60334816e+02 1.37575190e+01 1.00824546e+02 -4.36459044e+00 1.16406562e+00 9.93712470e+01
1716.lowfreq: -7.5093 -0.0010 -0.0006 -0.0002 5.3413 8.5419 26.6711 31.6496 48.8952
frequency: 26.5062 31.6142 48.7855 88.7283 110.3342 126.0793 170.7958 198.8170 201.0101 204.8279 227.6880 244.9112 249.5426 258.4882 343.9758 354.9274 380.1177 406.4670 414.1218 467.1023 565.2953 658.5352 702.8757 775.3388 784.5518 841.7642 872.9658 890.8342 905.3329 919.2896 957.2495 971.5178 979.4163 989.0210 1009.6436 1050.7126 1052.7153 1096.4174 1119.0526 1130.3224 1153.3108 1163.9063 1193.9641 1243.2649 1282.9039 1290.3666 1296.3063 1321.8287 1330.5693 1339.8497 1371.2126 1380.7478 1387.6222 1392.4051 1400.3190 1448.2547 1457.1938 1462.6538 1464.1261 1465.3733 1474.7371 1477.5747 1482.2587 1487.8341 1608.0569 1669.4613 2959.8754 2968.4505 2969.2773 2975.0921 2982.1759 2987.3703 3027.1791 3039.0756 3041.9861 3061.3531 3065.7660 3070.2833 3078.4977 3084.6924 3085.3631 3095.4385 3109.2030 3150.2285
redmass: 3.7570 3.4762 3.1524 2.5911 2.8995 1.6803 2.6673 1.2509 1.7621 1.9781 1.2564 1.1859 2.3106 2.6591 2.2878 2.7748 2.9538 2.5699 2.9994 2.8010 2.5401 3.4062 5.3592 2.9928 3.4242 1.9037 1.6437 2.0789 1.9072 1.2048 1.4559 2.2619 2.9167 1.0788 1.6869 1.4073 1.5985 2.1040 1.9482 2.2950 2.4155 2.3215 1.9058 1.1708 1.4072 1.4115 1.3974 1.5406 1.4230 1.4053 1.4858 1.2174 1.2190 1.2320 1.2211 1.0790 1.0474 1.0456 1.0671 1.0571 1.0524 1.0473 1.0510 1.0535 11.0515 5.8326 1.0788 1.0357 1.0372 1.0381 1.0582 1.0403 1.0905 1.0957 1.0958 1.0995 1.0998 1.0989 1.0995 1.0967 1.0987 1.1007 1.0935 1.0921
irintensity: 1.2168 0.0979 2.1176 1.8538 1.8292 0.0194 0.9281 0.1003 0.7398 1.0769 1.7477 1.0285 2.5977 0.1304 2.5760 1.2221 2.1480 5.7816 3.3776 0.2564 7.3660 13.0721 3.9559 0.6001 3.1068 2.4307 2.8327 5.2846 2.0502 1.7184 0.5546 32.9372 134.5760 60.1182 18.3714 32.1361 0.2898 164.3290 42.1821 6.8123 97.7132 81.6590 8.4935 0.2725 32.9583 62.5567 21.3490 6.2316 3.2314 8.8629 4.2395 21.0986 15.0006 13.8242 16.8413 5.6100 16.5479 4.7039 26.2586 19.8230 6.7900 7.5483 28.8269 12.5534 150.9200 107.7640 20.2738 34.7375 19.0559 38.6604 18.3296 38.1256 7.0241 25.6153 17.8179 16.7746 30.5961 106.5032 37.7872 11.0884 40.9134 24.3795 16.1262 8.4872
temp: 298.150 k
press: 1.00000 atm
elementType: 8 8 6 6 6 6 6 6 6 6 6 6 1 1 1 1 1 1 1 1 1 1 1 1 1 1 1 1 1 1
symmnumber: 1
zpe: 679629.0 jmol-1
zpe.correction: 0.258857 hartree
zpe.thermalcorrener: 0.274039 hartree
zpe.thermalcorrenthalpy: 0.274983 hartree
zpe.thermalcorrgfe: 0.215550 hartree
zpe.sumelectzpe: -541.333990 hartree
zpe.sumelectthermal: -541.318808 hartree
zpe.sumelectthermalent: -541.317864 hartree
zpe.sumelectthermalfe: -541.377297 hartree
dipole: -0.4032 -0.4968 -1.6822
dipole: 1.7998
quadrupole: -59.4420 -74.0800 -78.7117
quadrupole: 4.0868 1.5438 -1.0592
quadrupole: 11.3026 -3.3354 -7.9672 4.0868 1.5438 -1.0592
hfenergy: -541.5928467 hartree
pointgroup: C01 [X(C10H18O2)]
dipole: 0.1152115 0.2968391 -0.6324724 debye
polarizability: 157.8809009|18.0279758|103.8707889|4.6087918|-0.8782955|98.7789194 unknown
InChI: InChI=1S/C10H18O2/c1-5-6-10(11)12-9(4)7-8(2)3/h5-6,8-9H,7H2,1-4H3
charge 0 multiplicity 1
30 atoms
O  0.131694 -0.396145 -0.758697
O  1.17881 -0.76629 1.305327
C  -2.879434 0.843457 -0.225312
C  -2.300288 -0.403343 -0.954983
C  -1.110529 -1.100914 -0.268983
C  -3.591987 0.45624 1.094478
C  -1.821002 1.945068 0.024096
C  -0.97276 -2.587612 -0.629064
C  1.210992 -0.314359 0.129882
C  2.350155 0.373931 -0.521327
C  3.518848 0.586779 0.145218
C  4.731474 1.272204 -0.423748
H  -3.649397 1.266312 -0.905487
H  -1.978722 -0.124108 -1.97758
H  -3.112873 -1.148836 -1.070649
H  -1.132298 -0.985833 0.830226
H  -2.880311 0.03427 1.829253
H  -4.386831 -0.293581 0.9201
H  -4.058486 1.342952 1.562507
H  -1.288063 2.211245 -0.906475
H  -2.299906 2.858315 0.424685
H  -1.065252 1.614312 0.760013
H  -0.917127 -2.722067 -1.724279
H  -0.065886 -3.01875 -0.171323
H  -1.847354 -3.149469 -0.252968
H  2.201681 0.698799 -1.556657
H  3.579087 0.227117 1.183673
H  4.997365 2.161694 0.180527
H  4.576289 1.593577 -1.467605
H  5.611314 0.600034 -0.391245
