program: Gaussian 09
title: 000161850
version: EM64L-G09RevD.01
frameworkgroup: C1[X(C7H13NO4)]
method: RPBEPBE
basis: SDD
operation: Freq
keyword: #p
keyword: freq=noraman
keyword: PBEPBE/SDD
title: #p freq=noraman PBEPBE/SDD
converged: YES YES NO NO
title: Mulliken charges:
elementType: O O O O N C C C C C C C H H H H H H H H H H H H H
charge: -0.448542 -0.425039 -0.421204 -0.215546 -0.098380 -0.059882 -0.162001 -0.434911 -0.118716 -0.378363 -0.642969 0.115508 0.255797 0.222255 0.247691 0.238222 0.187719 0.180340 0.237164 0.267984 0.223154 0.182110 0.337021 0.332555 0.378030
chargesum: 0.00000
title: Mulliken charges with hydrogens summed into heavy atoms:
elementType: O O O O N C C C C C C C
charge: -0.111520 -0.092483 -0.043174 -0.215546 -0.098380 0.195914 0.060254 0.051002 0.069004 0.039142 0.030280 0.115508
polarizability: 1.06118337e+02 1.00252454e+00 9.25513948e+01 2.42941100e+00 8.57259911e-01 8.13017757e+01
1716.lowfreq: -1.8315 -0.0005 -0.0004 0.0007 8.5259 14.9699 42.3748 66.1932 107.0204
frequency: 42.2395 66.1360 106.8924 158.2074 180.0402 208.6412 228.0764 234.6209 246.9465 275.0823 284.2471 337.2896 351.8870 399.9640 427.0837 445.9022 480.1094 571.8075 579.0376 601.8869 686.7237 739.7571 772.7551 832.7357 869.7607 902.1734 932.2429 971.2200 1017.3287 1032.0615 1038.5193 1060.8721 1077.6186 1096.6512 1118.9898 1145.4763 1161.8461 1185.6885 1205.7979 1238.9498 1256.2933 1279.0775 1287.7589 1298.4992 1328.8448 1349.9511 1355.4800 1369.3597 1382.2086 1403.1138 1431.2523 1432.4673 1457.1425 1476.0877 1488.1808 1669.0013 2840.8681 2855.4173 2877.2399 2914.2348 2929.9000 3026.3243 3040.3023 3045.6320 3099.5260 3110.3256 3516.1245 3543.6222 3551.8828
redmass: 9.9440 5.3416 3.7434 4.7395 3.5217 2.5785 3.4366 1.2516 1.3563 1.1060 3.4854 2.6200 3.0397 2.6040 2.7065 4.7994 3.8059 3.9666 1.7919 2.6173 3.7944 3.1627 4.4264 2.9944 3.3143 2.9862 2.3829 4.9342 2.3634 2.5887 2.5115 2.1393 1.9568 1.7025 1.3882 1.6783 1.2955 1.6061 1.2323 1.4081 1.4676 1.9319 1.4663 1.1761 1.4855 1.4442 1.5535 1.5196 1.3841 1.7805 1.0945 1.1604 1.1064 1.0720 1.0455 8.6601 1.0689 1.0608 1.0779 1.0831 1.0855 1.0601 1.0747 1.0872 1.1034 1.0982 1.0640 1.0660 1.0661
irintensity: 0.6851 0.2389 5.9702 5.8844 0.8927 6.0517 0.5958 50.2745 47.4162 195.0200 9.3515 18.6275 5.4236 20.2234 10.8813 2.1164 4.9723 27.9359 56.0157 52.8079 49.7684 26.9855 3.2969 6.0371 28.3329 7.7772 14.2813 49.2933 312.7349 18.9679 85.2073 20.0223 24.1473 1.5721 5.9403 35.1778 53.9362 21.9747 33.9533 2.5422 9.1045 7.6358 24.5004 3.0452 7.1221 10.4742 14.2328 0.9256 1.6202 8.5112 15.2861 2.0797 20.6911 7.9167 26.2695 214.8388 41.0255 135.2513 62.1858 109.2668 90.4349 17.8411 30.8428 27.9467 8.2772 11.9308 24.4551 4.8640 3.0387
temp: 298.150 k
press: 1.00000 atm
elementType: 8 8 8 8 7 6 6 6 6 6 6 6 1 1 1 1 1 1 1 1 1 1 1 1 1
symmnumber: 1
zpe: 531915.8 jmol-1
zpe.correction: 0.202596 hartree
zpe.thermalcorrener: 0.215323 hartree
zpe.thermalcorrenthalpy: 0.216267 hartree
zpe.thermalcorrgfe: 0.163923 hartree
zpe.sumelectzpe: -629.193254 hartree
zpe.sumelectthermal: -629.180527 hartree
zpe.sumelectthermalent: -629.179583 hartree
zpe.sumelectthermalfe: -629.231927 hartree
dipole: -3.1445 -2.0332 -1.3369
dipole: 3.9760
quadrupole: -56.8577 -73.9750 -73.6171
quadrupole: 0.2664 -1.5657 -9.5106
quadrupole: 11.2922 -5.8251 -5.4671 0.2664 -1.5657 -9.5106
hfenergy: -629.3958498 hartree
pointgroup: C01 [X(C7H13N1O4)]
dipole: 1.2805262 0.7742758 -0.4557801 debye
dipolederiv: -0.1857345 -0.0679585 0.0533411 -0.122523 -0.7086383 0.1687943 0.0878178 0.1312843 -0.6935185 -0.4040808 0.2536619 -0.0591363 0.2871518 -0.4118028 0.1799837 -0.0646459 0.1296684 -0.7324076 -0.5547911 0.4005721 -0.1718104 0.3940092 -1.016437 0.1770091 -0.1839763 0.1662397 -0.4061454 -0.7275763 -0.2180785 0.2278307 0.0174918 -0.7243965 0.1570566 0.1947457 0.2755159 -0.466967 -0.5603361 -0.0437163 -0.0131119 -0.0071012 -0.5427792 -0.1020565 -0.0178811 -0.0589814 -0.530583 -0.2325684 -0.1738218 0.025494 -0.3441107 0.4352382 -0.0077728 0.0210319 -0.022626 0.3149364 0.286827 0.1217233 -0.058271 0.0894817 0.3844531 -0.0581601 -0.1460179 -0.1359418 0.5194202 -0.0306688 -0.000058 0.0838229 0.1461231 0.0166866 -0.034987 0.1369733 0.0196803 0.0387265 0.3802253 -0.0694102 0.0367144 -0.1240814 0.2273072 -0.0655624 0.105374 -0.1069837 0.5880273 0.5278261 -0.0556965 -0.1531683 -0.0483172 0.0546016 -0.1233831 -0.1508904 -0.0236269 0.3184293 0.1260807 0.1460457 0.1262225 0.159266 0.259336 0.0644685 0.0994657 0.0713577 0.4266858 1.2622755 -0.1489853 -0.2205451 -0.2973876 1.2562009 -0.4424713 -0.2230891 -0.5016426 0.4252201 0.0678505 0.0371462 0.0209878 0.0739832 -0.0474829 0.0063653 -0.041793 0.1182124 -0.1186338 -0.1202459 -0.1012547 -0.1174258 -0.0902082 -0.0582276 -0.0713239 -0.0810336 -0.0615449 -0.1340979 0.0490883 0.0595811 -0.0074615 0.0514006 -0.0930232 -0.0307052 -0.0152 0.001168 0.0905506 0.0629022 -0.0410905 -0.000396 -0.0316956 0.0930941 0.069841 -0.008456 0.0156016 -0.0632434 -0.2328849 -0.001082 0.1143185 -0.0096099 0.0077169 0.0372404 0.0927645 0.0235752 -0.0942215 -0.0812997 0.0036784 -0.004567 -0.0505257 0.0676324 0.0856324 0.1603267 0.0173438 -0.2262296 0.0161387 0.0361537 0.0096918 0.0939658 -0.1247176 -0.0029981 0.0275226 0.0230697 0.0865178 -0.0990387 -0.0655383 0.0131997 -0.0045705 0.1602255 0.0093161 0.0414112 0.0203066 0.0696884 0.0668641 0.1455778 -0.0124357 0.058965 -0.1381902 -0.0040111 -0.0380497 0.0082105 0.0675841 0.0353037 -0.047935 0.0053858 -0.032896 0.0001379 0.0897404 -0.1023259 -0.0848426 -0.3002077 -0.0254281 0.0180882 0.0604771 0.1001387 0.398154 -0.0291032 0.0107341 0.0023566 0.2720605 0.2153763 -0.1717593 -0.0618259 -0.2347099 0.1772797 -0.1180606 -0.0449807 -0.0543556 0.2422397 0.1578947 -0.0158433 0.1026684 -0.07424 0.3276314 0.0451476 0.1401721 0.026955 0.3061687 unknown
polarizability: 106.3063549|0.6200862|92.5387745|-1.6081492|-0.3379452|81.1263778 unknown
InChI: InChI=1S/C7H13NO4/c1-8-3-6(10)5(9)2-4(8)7(11)12/h4-6,9-11H,2-3H2,1H3
charge 0 multiplicity 1
25 atoms
O  1.714714 1.72568 -1.175719
O  2.28145 -0.860759 1.517573
O  -2.663724 1.605104 -0.265625
O  -2.815885 -0.437384 0.820473
N  -0.187939 -1.146214 -0.25744
C  -0.691515 0.242102 -0.327402
C  1.639488 1.129929 0.172655
C  0.16756 1.166072 0.58698
C  2.170151 -0.325928 0.152054
C  1.237234 -1.241553 -0.648998
C  -0.996108 -2.124402 -1.017017
C  -2.137975 0.364209 0.145675
H  -0.650027 0.660565 -1.36431
H  2.242714 1.735674 0.887075
H  -0.207412 2.200893 0.523598
H  0.088225 0.802749 1.627374
H  3.170792 -0.339725 -0.341872
H  1.381888 -0.994318 -1.733447
H  1.565792 -2.284469 -0.49307
H  -2.026192 -2.144061 -0.630173
H  -0.56484 -3.130872 -0.874262
H  -1.022294 -1.912521 -2.116865
H  2.655342 1.717756 -1.487666
H  2.920914 -0.30412 2.032223
H  -3.590652 1.691792 0.087088
