program: Gaussian 09
title: 000013267
version: EM64L-G09RevD.01
frameworkgroup: C1[X(C11H16N2O3)]
method: RPBEPBE
basis: SDD
operation: Freq
keyword: #p
keyword: freq=noraman
keyword: PBEPBE/SDD
title: #p freq=noraman PBEPBE/SDD
converged: YES YES NO NO
title: Mulliken charges:
elementType: O O O N N C C C C C C C C C C C H H H H H H H H H H H H H H H H
charge: -0.223830 -0.237715 -0.211860 -0.257241 -0.381423 0.031176 -0.428717 -0.431702 -0.397588 -0.398422 -0.393006 0.236123 -0.313483 0.210948 0.146411 -0.676958 0.242656 0.246187 0.202622 0.200948 0.245027 0.203875 0.197393 0.197439 0.203578 0.201326 0.199739 0.285481 0.366198 0.256314 0.257538 0.220968
chargesum: 0.00000
title: Mulliken charges with hydrogens summed into heavy atoms:
elementType: O O O N N C C C C C C C C C C C
charge: -0.223830 -0.237715 -0.211860 -0.257241 -0.015226 0.273832 0.020092 0.014273 0.003681 0.002595 0.008058 0.236123 -0.028002 0.210948 0.146411 0.057861
polarizability: 1.72657067e+02 -3.07882751e+00 1.34789977e+02 -2.57253283e+00 4.57061240e+00 1.03078252e+02
1716.lowfreq: -19.8471 -6.7382 -0.0008 -0.0007 -0.0004 5.6179 26.3673 40.5344 60.9960
frequency: 25.3613 39.9114 60.9772 80.8691 149.9855 158.8284 205.1070 217.8337 224.1415 235.6082 250.6287 255.8070 334.5934 362.7880 397.0836 407.7498 444.1056 446.6361 470.2388 483.7988 531.2213 597.2563 630.6330 669.7135 709.3414 712.2508 748.8958 781.3091 793.6504 812.1459 843.4766 865.8122 894.2513 900.4879 923.3522 938.7656 1000.3743 1044.0005 1048.0466 1050.3176 1058.0765 1062.8768 1078.0626 1099.8280 1109.4619 1163.2943 1199.0702 1215.6542 1249.9532 1254.0741 1260.8704 1265.5748 1285.9031 1308.8572 1316.0089 1329.3851 1333.6049 1341.6604 1347.9503 1349.0440 1350.1749 1371.9528 1381.5552 1400.6065 1464.1693 1466.4703 1471.3703 1473.7413 1476.5501 1478.7251 1487.1183 1592.9694 1647.8969 1653.9716 2970.0278 2971.0344 2974.8487 2994.5424 2996.7707 2998.7416 3028.8260 3033.7788 3034.8902 3037.9377 3043.9431 3066.2459 3074.3079 3102.9647 3120.2540 3516.8816
redmass: 3.2283 7.3531 4.1534 3.5301 8.3572 5.4320 3.3027 2.8445 1.8165 1.4685 4.2674 2.2879 1.8202 11.5424 4.4931 10.2416 3.6773 3.6355 2.2749 5.7717 2.8367 7.7150 4.4931 2.7707 7.4612 4.8207 2.8491 1.7152 1.4239 2.9845 1.9747 2.0079 2.1851 1.6373 1.6943 2.3586 2.4074 1.8942 3.2520 2.0091 2.5933 1.1594 1.3590 2.8130 2.6168 2.5103 1.6262 3.4896 1.3713 1.2994 1.2746 1.3822 1.4631 1.3398 2.8739 1.8758 1.3468 1.4496 1.4617 2.7455 1.5046 1.6383 1.2199 1.6334 1.0873 1.0877 1.0848 1.0488 1.0839 1.0606 1.0912 9.9165 5.7147 9.9339 1.0631 1.0630 1.0621 1.0619 1.0629 1.0347 1.0858 1.0985 1.0949 1.0828 1.1031 1.1016 1.0995 1.1005 1.1024 1.0767
irintensity: 2.7512 0.1099 0.3124 0.0876 8.6557 3.2845 1.5830 3.6477 0.0500 3.1192 2.4358 3.4823 0.3703 20.8250 3.7900 9.9240 14.3336 4.4856 3.7349 18.0828 19.8958 0.5956 13.2747 14.4158 0.5445 0.0848 2.3082 114.2069 1.9980 3.2037 1.3757 2.0006 1.8686 20.3715 0.0453 5.9788 26.5599 2.5495 1.6570 16.3815 14.7897 1.7250 0.7839 19.1525 0.2609 4.2268 0.5384 159.2700 14.6823 12.8443 1.6664 9.4574 9.5132 1.2666 202.4680 216.7900 2.3263 0.2760 15.2255 138.3475 28.7339 13.1854 13.4768 62.4299 7.6487 5.8711 6.9083 27.4218 15.8723 4.9159 4.2218 369.9180 412.2640 132.6478 34.0926 32.4720 32.1203 45.6218 16.2978 18.4448 21.6447 58.5339 49.1978 1.0065 43.1503 1.5703 38.2460 16.8975 5.5362 64.4040
temp: 298.150 k
press: 1.00000 atm
elementType: 8 8 8 7 7 6 6 6 6 6 6 6 6 6 6 6 1 1 1 1 1 1 1 1 1 1 1 1 1 1 1 1
symmnumber: 1
zpe: 694192.0 jmol-1
zpe.correction: 0.264404 hartree
zpe.thermalcorrener: 0.279321 hartree
zpe.thermalcorrenthalpy: 0.280265 hartree
zpe.thermalcorrgfe: 0.221577 hartree
zpe.sumelectzpe: -762.779346 hartree
zpe.sumelectthermal: -762.764429 hartree
zpe.sumelectthermalent: -762.763485 hartree
zpe.sumelectthermalfe: -762.822173 hartree
dipole: -1.5105 -0.6083 0.7314
dipole: 1.7851
quadrupole: -102.2330 -102.1110 -93.8345
quadrupole: -1.8549 2.9732 -4.2932
quadrupole: -2.8402 -2.7182 5.5583 -1.8549 2.9732 -4.2932
hfenergy: -763.0437502 hartree
pointgroup: C01 [X(C11H16N2O3)]
dipole: 0.6059629 -0.2032104 -0.2911253 debye
polarizability: 172.5588151|4.1555977|135.4669183|-0.6511443|-2.0645874|102.4995633 unknown
InChI: InChI=1S/C11H16N2O3/c1-7-9(14)12-11(16)13(10(7)15)8-5-3-2-4-6-8/h7-8,12H,2-6H2,1H3
charge 0 multiplicity 1
32 atoms
O  -0.014431 -1.989256 0.518689
O  -0.39356 2.582374 -0.479927
O  -4.293803 0.217164 0.315606
N  -0.14173 0.277657 -0.043011
N  -2.304938 1.334228 -0.099133
C  1.361539 0.431416 -0.095559
C  2.009507 0.201505 1.291569
C  1.999724 -0.449376 -1.196196
C  3.533025 0.46841 1.206842
C  3.523289 -0.173738 -1.26358
C  4.198121 -0.398728 0.11087
C  -0.72033 -0.980961 0.24676
C  -2.243871 -1.118955 0.166734
C  -0.905415 1.459921 -0.232044
C  -3.047332 0.17237 0.1537
C  -2.619879 -1.97708 -1.084561
H  1.511491 1.490863 -0.373323
H  1.828374 -0.838123 1.617091
H  1.544373 0.877141 2.035161
H  1.526375 -0.226438 -2.171981
H  1.826796 -1.516329 -0.970204
H  3.99765 0.267796 2.190969
H  3.709475 1.540575 0.980922
H  3.69863 0.87218 -1.590586
H  3.981409 -0.82905 -2.028779
H  5.278495 -0.166335 0.045854
H  4.113187 -1.468973 0.38898
H  -2.556023 -1.692184 1.058578
H  -2.822115 2.216191 -0.181002
H  -2.096779 -2.945542 -1.030079
H  -3.708943 -2.146741 -1.095437
H  -2.330709 -1.46768 -2.021022
