program: Gaussian 09
title: 000161776
version: EM64L-G09RevD.01
frameworkgroup: C1[X(C17H21N3O)]
method: RPBEPBE
basis: SDD
operation: Freq
keyword: #p
keyword: freq=noraman
keyword: PBEPBE/SDD
title: #p freq=noraman PBEPBE/SDD
converged: YES YES NO NO
title: Mulliken charges:
elementType: O N N N C C C C C C C C C C C C C C C C C H H H H H H H H H H H H H H H H H H H H H
charge: -0.259726 -0.085777 -0.405365 -0.617224 -0.167653 -0.051500 -0.535147 0.006667 -0.627461 -0.469552 0.376266 -0.219371 0.372378 -0.578883 -0.650229 0.230313 -0.456302 -0.455611 -0.374955 -0.215528 0.220909 0.253220 0.200512 0.233893 0.200548 0.272690 0.209622 0.168285 0.222158 0.237763 0.234165 0.204709 0.219795 0.245499 0.187633 0.225794 0.262872 0.300945 0.225547 0.212927 0.312887 0.332288
chargesum: 0.00000
title: Mulliken charges with hydrogens summed into heavy atoms:
elementType: O N N N C C C C C C C C C C C C C C C C C
charge: -0.259726 -0.085777 -0.104421 0.027952 0.085567 0.149011 -0.100707 0.279356 -0.167540 -0.091645 0.376266 -0.219371 0.372378 -0.140009 0.002698 0.230313 -0.230508 -0.192740 -0.149408 -0.002601 0.220909
polarizability: 2.43067798e+02 -7.43245295e+00 2.30243976e+02 -1.08146589e-01 7.50545859e+00 1.27855192e+02
1716.lowfreq: -0.9410 0.0001 0.0003 0.0004 7.8824 15.5733 24.6372 32.6153 47.9955
frequency: 24.2410 32.5396 47.9678 77.1440 85.7829 133.3193 152.0995 187.9808 198.4206 212.5921 221.9366 262.5251 285.3933 299.6017 312.7956 328.3143 372.5419 390.6533 414.5153 446.7329 458.2176 473.4209 483.4843 489.5674 507.0222 510.9568 526.9265 549.5136 572.3609 596.4215 606.9806 618.1561 627.8503 684.2960 733.4660 739.8591 752.3005 774.4583 786.6106 806.9244 827.7095 847.5342 872.2097 879.0851 892.4908 906.4046 935.3040 951.1022 982.3270 997.6557 1034.8325 1039.3282 1045.4552 1050.8910 1075.5282 1080.0509 1098.5969 1104.0561 1105.4538 1118.5017 1129.6364 1150.7408 1163.6955 1174.8963 1192.0865 1203.8967 1224.5504 1226.0179 1236.8097 1253.5044 1259.7518 1273.9266 1280.0408 1284.8275 1295.0919 1310.4564 1322.1189 1327.0709 1347.8602 1351.5387 1361.5581 1365.5012 1378.9914 1407.5558 1418.4777 1433.2153 1443.2927 1452.1425 1458.4233 1464.0418 1469.3977 1478.3151 1486.1816 1502.6266 1568.0170 1594.3222 1617.7828 1627.9278 1641.6416 2797.9229 2811.5812 2854.4004 2947.1415 2959.6221 2966.7633 2970.6911 3005.0550 3013.9052 3029.9842 3032.3252 3041.4813 3044.8210 3089.7685 3121.9070 3138.9364 3155.1151 3217.3948 3515.6363 3613.8991 3673.6655
redmass: 5.3510 5.0916 5.0650 3.5423 4.4598 2.7747 2.5678 4.4798 3.7040 1.7160 2.7619 2.7346 3.3296 2.4327 4.1131 3.0032 2.9800 2.9742 2.7794 3.3280 3.3344 2.9869 1.9938 1.4125 2.2447 1.6613 2.0947 3.5001 3.1488 3.7399 3.4322 2.4513 2.2886 2.6029 4.7522 3.7633 1.6267 2.0082 2.2670 2.2331 4.2062 3.7158 1.8506 1.6353 1.5072 3.2064 2.2613 1.3214 1.8362 3.4963 2.0285 2.3491 1.9319 2.8629 2.1452 2.3555 2.1308 2.0556 1.9943 1.7592 2.3251 1.8183 1.5636 1.2041 1.5909 1.4020 2.0487 1.7497 1.5596 1.5186 1.3031 1.4081 1.3903 1.6753 1.7954 1.5883 1.4254 1.3947 1.8641 1.7486 1.7913 1.8460 1.5147 2.5401 3.7552 1.1753 1.1150 3.0071 1.1826 1.1563 1.1198 1.0729 1.0643 3.2791 6.9293 1.4302 7.4665 8.1414 3.5791 1.0722 1.0767 1.0577 1.0773 1.0664 1.0649 1.0589 1.0834 1.0892 1.0992 1.0733 1.0976 1.0950 1.0991 1.0854 1.0915 1.0981 1.0981 1.0447 1.0808 1.1042
irintensity: 15.2280 1.2054 0.5003 1.5167 3.1086 0.1042 4.4098 1.9736 12.6748 0.1567 0.2718 0.8494 1.4409 4.7007 3.6747 0.9861 4.1115 6.9366 0.9653 0.4720 1.5953 5.6894 17.3837 82.5211 27.8921 89.1452 105.4430 2.5703 7.4595 1.6060 26.5537 37.6660 16.1163 27.3620 4.1775 4.4300 69.7227 36.8129 2.5872 1.0851 3.4868 5.9513 7.6826 1.5159 4.7746 9.6752 2.0914 1.2613 5.5866 2.9098 28.0853 12.9333 23.2942 1.9702 6.8496 4.8751 11.0526 6.8550 10.9216 10.7057 10.3620 9.8018 22.6515 2.0042 3.0128 1.4513 6.6576 1.6758 4.7895 5.3302 7.4937 1.3711 28.8836 3.3963 33.3322 31.5805 11.2022 2.8123 13.3168 25.0371 33.0683 82.1604 0.4849 5.3981 8.5059 3.3410 10.2693 19.0626 24.5743 6.4965 7.5729 4.4067 25.1720 1.6970 3.2807 63.4534 13.2906 6.7882 267.1323 53.8475 83.7263 155.9193 3.5125 23.4441 41.0785 31.8950 31.1769 12.3200 22.8536 43.0127 51.1100 37.3728 32.6676 2.5250 25.0761 33.6850 2.0401 28.8346 60.7319 20.5173
temp: 298.150 k
press: 1.00000 atm
elementType: 8 7 7 7 6 6 6 6 6 6 6 6 6 6 6 6 6 6 6 6 6 1 1 1 1 1 1 1 1 1 1 1 1 1 1 1 1 1 1 1 1 1
symmnumber: 1
zpe: 925971.6 jmol-1
zpe.correction: 0.352684 hartree
zpe.thermalcorrener: 0.370961 hartree
zpe.thermalcorrenthalpy: 0.371905 hartree
zpe.thermalcorrgfe: 0.305910 hartree
zpe.sumelectzpe: -898.366807 hartree
zpe.sumelectthermal: -898.348529 hartree
zpe.sumelectthermalent: -898.347585 hartree
zpe.sumelectthermalfe: -898.413581 hartree
dipole: -1.3914 0.4333 -4.5098
dipole: 4.7394
quadrupole: -98.9367 -112.3853 -132.3255
quadrupole: -5.3459 -17.2751 5.1064
quadrupole: 15.6125 2.1638 -17.7763 -5.3459 -17.2751 5.1064
hfenergy: -898.7194907 hartree
pointgroup: C01 [X(C17H21N3O1)]
dipole: -0.5376411 -0.1998204 1.7742185 debye
polarizability: 242.8938904|7.6157824|230.2043048|-0.3829409|8.8032771|128.0687709 unknown
InChI: InChI=1S/C17H21N3O/c1-20-9-10(6-16(18)21)5-13-12-3-2-4-14-17(12)11(8-19-14)7-15(13)20/h2-4,8,10,13,15,19H,5-7,9,18H2,1H3
charge 0 multiplicity 1
42 atoms
O  4.570699 1.237916 -1.437207
N  0.972547 -2.463452 -0.160631
N  -4.524721 0.103704 0.123478
N  5.02969 2.097969 0.664791
C  0.162015 -0.108383 -0.371745
C  -0.163668 -1.551134 0.170665
C  1.508758 0.400118 0.188847
C  2.64572 -0.60039 -0.099992
C  -1.506209 -2.115261 -0.397499
C  2.251227 -1.992472 0.427028
C  -0.995667 0.85728 -0.108542
C  -2.281708 0.277753 -0.06244
C  -2.614594 -1.113763 -0.18996
C  3.989656 -0.144063 0.515697
C  0.736159 -3.880117 0.195994
C  -3.47484 1.03325 0.134175
C  -0.933109 2.255799 0.056817
C  -3.999364 -1.197819 -0.067895
C  -3.412894 2.437942 0.291118
C  -2.126442 3.022525 0.250305
C  4.541202 1.109235 -0.177756
H  0.277307 -0.223366 -1.472106
H  -0.280762 -1.465827 1.286778
H  1.754139 1.38016 -0.261482
H  1.413095 0.555734 1.284778
H  2.784269 -0.672689 -1.195877
H  3.037641 -2.724992 0.160851
H  2.194944 -1.958479 1.550557
H  -1.753721 -3.074095 0.091787
H  -1.352131 -2.328911 -1.475614
H  4.743888 -0.94573 0.379649
H  3.880032 0.02047 1.606232
H  1.646373 -4.460942 -0.036924
H  -0.086423 -4.30544 -0.400735
H  0.499352 -4.03219 1.280293
H  0.028006 2.78071 0.034661
H  -4.661566 -2.061499 -0.098819
H  -5.511729 0.320832 0.238821
H  -4.305409 3.055757 0.438768
H  -2.03842 4.109001 0.368209
H  4.992939 2.012564 1.678565
H  5.433217 2.937397 0.24846
