program: Gaussian 09
title: 000161774
version: EM64L-G09RevD.01
frameworkgroup: C1[X(C14H15N)]
method: RPBEPBE
basis: SDD
operation: Freq
keyword: #pfreq=noraman
keyword: PBEPBE/SDD
title: #p freq=noraman PBEPBE/SDD
converged: YES YES NO NO
title: Mulliken charges:
elementType: N C C C C C C C C C C C C C C H H H H H H H H H H H H H H H
charge: -0.328298 -0.050664 -0.624948 -0.594365 -0.111281 0.412770 0.412505 0.441119 -0.465678 -0.461205 -0.458024 -0.457602 -0.244127 -0.243367 -0.645414 0.210400 0.207531 0.244504 0.240455 0.225694 0.257776 0.233743 0.233981 0.236842 0.236770 0.224171 0.224207 0.193076 0.229967 0.219459
chargesum: 0.00000
title: Mulliken charges with hydrogens summed into heavy atoms:
elementType: N C C C C C C C C C C C C C C
charge: -0.070521 0.159736 -0.172913 -0.128216 -0.111281 0.412770 0.412505 0.441119 -0.231935 -0.227224 -0.221182 -0.220832 -0.019956 -0.019160 -0.002911
polarizability: 1.94522332e+02 2.73531501e+00 1.92722397e+02 -8.58865647e+00 -2.46487230e-01 8.11043005e+01
1716.lowfreq: -7.6472 0.0001 0.0005 0.0009 8.8629 15.2092 64.2704 88.2039 112.9740
frequency: 64.2522 88.2012 112.9554 165.5778 184.5633 199.3794 245.9625 272.9262 312.8845 368.9401 392.8765 417.8686 465.9838 471.2680 480.4103 493.9382 539.9297 580.8302 594.3908 630.7891 639.6890 684.3835 761.0838 779.9752 790.2209 814.0233 833.6435 863.1633 881.3524 910.4894 919.2016 972.4147 975.3417 985.2879 1011.2479 1029.6443 1060.7913 1070.2916 1087.1624 1108.3271 1115.8663 1136.6881 1154.7371 1174.5353 1180.1251 1185.5493 1223.2982 1240.3883 1251.5054 1252.5914 1287.8938 1303.7069 1333.5463 1367.9248 1387.9020 1397.6174 1417.0130 1435.5371 1438.7801 1447.8666 1456.3491 1464.5439 1464.7235 1471.1349 1496.4636 1520.4040 1594.7965 1602.8009 1627.9138 2850.0009 2875.6169 2958.8402 2969.9992 3015.8739 3023.8941 3039.9821 3078.5689 3116.0761 3116.5127 3125.3685 3127.0338 3152.0136 3153.7023 3439.6728
redmass: 3.1341 2.5085 2.1977 3.6597 1.7558 1.9986 3.0588 2.6454 3.7078 4.3666 2.9106 3.7610 2.7942 3.2637 3.1659 4.3964 3.9643 4.9435 3.6267 2.2068 3.0584 2.2439 1.2019 2.3552 3.8248 4.3626 2.0657 1.4108 2.9887 1.3949 1.4971 2.5205 1.3426 1.3879 3.0602 3.6446 2.3014 2.3288 1.8455 1.3408 1.8391 1.2379 3.5590 1.2746 1.2577 1.6416 1.4293 1.3370 1.6412 1.7085 2.0372 1.4649 1.3888 1.7628 2.3875 4.1747 2.9113 2.7167 1.2257 1.1411 1.2008 1.1152 2.4379 1.1104 1.0501 4.5250 6.1320 6.8548 6.8876 1.0809 1.0563 1.0603 1.0630 1.0993 1.0751 1.0968 1.0997 1.0862 1.0862 1.0916 1.0907 1.0994 1.0989 1.0745
irintensity: 0.7973 0.8805 1.4026 1.1796 0.2193 1.5781 0.2265 11.5961 1.2809 3.3993 11.6630 7.8287 1.7227 2.1137 0.4485 3.5261 10.7345 3.6242 0.1655 57.8932 2.3621 34.7324 0.3635 52.8372 13.3991 2.1238 62.3809 2.7920 1.4402 0.5061 2.6261 4.5815 0.0418 2.5783 10.4997 9.5591 2.1162 8.1956 2.8474 1.7701 2.3371 3.0705 38.2028 0.3273 5.0391 3.4622 1.4054 3.9023 2.9590 5.1254 0.9753 0.1842 2.3566 42.0358 8.8265 2.2030 3.6919 2.5076 4.3727 8.3644 11.2945 5.6443 0.8389 4.4482 22.8199 3.5265 0.2102 27.4743 3.7180 60.6796 141.4490 26.3757 22.9254 28.7000 48.1511 33.2815 38.1828 2.1315 6.4652 10.4778 28.2448 53.8731 25.9160 1.3413
temp: 298.150 k
press: 1.00000 atm
elementType: 7 6 6 6 6 6 6 6 6 6 6 6 6 6 6 1 1 1 1 1 1 1 1 1 1 1 1 1 1 1
symmnumber: 1
zpe: 662354.5 jmol-1
zpe.correction: 0.252277 hartree
zpe.thermalcorrener: 0.264563 hartree
zpe.thermalcorrenthalpy: 0.265507 hartree
zpe.thermalcorrgfe: 0.214124 hartree
zpe.sumelectzpe: -596.181147 hartree
zpe.sumelectthermal: -596.168862 hartree
zpe.sumelectthermalent: -596.167918 hartree
zpe.sumelectthermalfe: -596.219301 hartree
dipole: 0.9393 -0.4315 0.8568
dipole: 1.3426
quadrupole: -79.3202 -79.3283 -94.9938
quadrupole: -1.4762 2.3491 -0.4625
quadrupole: 5.2272 5.2191 -10.4464 -1.4762 2.3491 -0.4625
hfenergy: -596.4334248 hartree
pointgroup: C01 [X(C14H15N1)]
dipole: -0.3646062 -0.1663846 -0.3441126 debye
polarizability: 194.738014|-2.6020217|192.6499466|-7.3451693|2.043046|80.9610683 unknown
InChI: InChI=1S/C14H15N/c1-15-13-8-11-6-2-4-10-5-3-7-12(9-13)14(10)11/h2-7,13,15H,8-9H2,1H3
charge 0 multiplicity 1
30 atoms
N  -3.632019 -0.517121 0.081722
C  -2.199579 -0.303799 -0.223665
C  -1.381748 -1.488908 0.335255
C  -1.680464 1.002083 0.424362
C  0.664563 0.026793 0.093014
C  0.113459 -1.306346 0.129264
C  -0.183856 1.18682 0.220542
C  2.092482 0.202073 -0.079983
C  0.966492 -2.406714 -0.01344
C  0.388918 2.463157 0.165558
C  2.930032 -0.954731 -0.208578
C  2.635752 1.528376 -0.116054
C  2.376019 -2.235409 -0.176834
C  1.797949 2.638377 0.004075
C  -4.575722 0.396347 -0.592628
H  -2.015341 -0.237522 -1.327551
H  -1.711731 -2.439366 -0.129589
H  -1.613958 -1.565582 1.418292
H  -1.920145 0.941556 1.506187
H  -2.219437 1.882103 0.028109
H  -3.893179 -1.501569 -0.065078
H  0.546825 -3.420036 0.002157
H  -0.256106 3.346335 0.250097
H  4.010415 -0.816227 -0.335214
H  3.717468 1.655894 -0.242771
H  3.017975 -3.117221 -0.280901
H  2.215191 3.651012 -0.0284
H  -4.435375 0.458154 -1.699885
H  -4.478557 1.419091 -0.186581
H  -5.610225 0.064681 -0.394282
