program: Gaussian 09
title: 000161771
version: EM64L-G09RevD.01
frameworkgroup: C1[X(C4H7FN2O3)]
method: RPBEPBE
basis: SDD
operation: Freq
keyword: #p
keyword: freq=noraman
keyword: PBEPBE/SDD
title: #p freq=noraman PBEPBE/SDD
converged: YES YES NO NO
title: Mulliken charges:
elementType: F O O O N N C C C C H H H H H H H
charge: -0.182127 -0.408804 -0.238822 -0.222676 -0.367545 -0.239576 -0.371178 -0.461898 0.199060 0.213486 0.263744 0.245754 0.302664 0.248773 0.325506 0.313441 0.380198
chargesum: 0.00000
title: Mulliken charges with hydrogens summed into heavy atoms:
elementType: F O O O N N C C C C
charge: -0.182127 -0.028605 -0.238822 -0.222676 -0.042039 0.073865 0.138320 0.089539 0.199060 0.213486
polarizability: 9.18857247e+01 -2.27283028e+00 6.32950972e+01 -3.08745151e+00 -1.31367004e+00 5.10526072e+01
1716.lowfreq: -7.7391 -4.1098 0.0000 0.0009 0.0009 5.7258 26.7538 47.9745 52.2372
frequency: 26.5251 47.9520 52.2328 82.7103 84.8901 178.5956 216.4499 268.5438 310.5739 440.2439 477.1079 505.7631 522.2843 581.9386 597.6621 638.7381 642.9363 737.4417 803.8427 878.9782 924.9318 979.8175 1016.8455 1067.5196 1085.3102 1089.3853 1180.9298 1219.7453 1248.5852 1297.9891 1319.7289 1331.8078 1385.7310 1440.9224 1454.8724 1474.0357 1661.6081 1670.4022 3009.1893 3035.4738 3063.9109 3102.3277 3357.6861 3511.7767 3555.9109
redmass: 9.5020 6.0677 10.6541 2.2868 4.1613 5.8910 5.6001 3.8258 10.9022 4.0589 3.8214 1.7652 1.7301 2.0740 4.8673 1.4284 3.4068 2.1800 2.0471 4.1425 3.7334 3.1944 4.1674 2.2362 2.5416 3.5619 1.3922 1.8022 1.5201 1.1503 1.1338 1.6785 1.5215 1.0848 1.1714 1.6295 8.2203 9.4213 1.0617 1.0602 1.0992 1.1055 1.0763 1.0640 1.0776
irintensity: 6.5128 4.4369 1.3631 3.2287 12.7534 0.2951 3.5392 2.3999 9.8026 14.2842 85.4683 31.9830 70.5804 185.9401 37.8378 115.0558 14.0612 49.0117 34.2192 4.0475 6.7179 47.7113 118.9963 4.8791 162.7350 3.3618 23.4591 67.0981 9.1230 7.1413 9.7179 88.8903 52.8903 35.6157 34.3347 179.3437 228.1668 223.5759 8.8927 17.2956 1.6815 10.2432 6.8574 22.4709 32.8513
temp: 298.150 k
press: 1.00000 atm
elementType: 9 8 8 8 7 7 6 6 6 6 1 1 1 1 1 1 1
symmnumber: 1
zpe: 320490.7 jmol-1
zpe.correction: 0.122068 hartree
zpe.thermalcorrener: 0.133085 hartree
zpe.thermalcorrenthalpy: 0.134029 hartree
zpe.thermalcorrgfe: 0.082788 hartree
zpe.sumelectzpe: -590.806435 hartree
zpe.sumelectthermal: -590.795419 hartree
zpe.sumelectthermalent: -590.794474 hartree
zpe.sumelectthermalfe: -590.845715 hartree
dipole: -1.2540 3.3044 -2.2730
dipole: 4.2022
quadrupole: -57.7920 -57.8680 -59.6090
quadrupole: 15.4632 2.3611 -1.9168
quadrupole: 0.6310 0.5550 -1.1860 15.4632 2.3611 -1.9168
hfenergy: -590.9285035 hartree
pointgroup: C01 [X(C4H7F1N2O3)]
dipole: -0.52284 -0.9119682 1.2760195 debye
dipolederiv: -0.5100274 -0.1513146 0.0258867 -0.2196887 -0.2375797 0.0034795 0.2450661 0.1572248 -0.154212 -0.7498377 0.5343946 0.0582322 0.5052573 -0.9060009 0.0169378 0.0236396 0.0382582 -0.4056754 -0.6871156 -0.2039305 -0.1176167 0.0537108 -0.9256564 -0.1120387 -0.0904281 -0.1704465 -0.3617322 -0.6450402 0.0175412 -0.1054781 0.0825233 -0.4250126 0.2797548 0.0798697 0.2770205 -0.855552 -1.1228565 -0.0854502 0.2120655 -0.2721531 -0.652952 0.1983178 0.2897626 0.1514653 -0.4150938 -0.2973416 0.1701636 -0.2663926 0.2846713 0.1846119 0.0358645 -0.7559246 -0.085288 -0.3661592 0.7031722 0.0013327 0.0149756 0.0195961 0.2754343 -0.0279116 0.1602596 0.0406211 0.176086 -0.4315173 -0.0583421 -0.1027606 -0.1655994 -0.123467 -0.0207973 -0.1597912 -0.0439976 0.0878492 1.3573674 -0.1925248 0.2234275 -0.291381 1.5036741 0.1753784 0.2451699 0.201955 0.2931153 1.7175637 0.1959615 0.0305259 0.1194341 0.4721959 -0.5477999 -0.1392853 -0.5004738 1.1500595 0.0402272 0.0133077 0.0340587 0.0339307 0.0646267 -0.0274617 -0.0254109 -0.079441 -0.0400492 0.0066415 -0.0488868 0.0295804 -0.026053 -0.0177562 0.0827683 0.0424937 0.0953092 0.0385787 0.1299206 -0.0335912 0.0178448 0.0050622 0.0448709 0.0516519 -0.0011136 0.0670521 0.0685303 0.0718121 0.0237976 -0.0022998 0.0502047 0.0730953 -0.0486441 0.0056351 -0.078257 -0.0480447 0.1436963 -0.0657834 -0.0161724 -0.0686299 0.3348473 -0.0081813 -0.0557334 0.0266157 0.1616486 0.1089181 -0.0367758 0.0377165 0.0125732 0.0647553 0.0055209 0.2188116 -0.0534504 0.308087 0.1644173 -0.0798994 -0.0735937 -0.1234585 0.2703132 -0.0568392 -0.0830209 -0.0441677 0.3625638 unknown
polarizability: 91.4539586|4.2117498|61.0790944|3.7728632|-4.8121068|53.7003761 unknown
InChI: InChI=1S/C4H7FN2O3/c5-7-4(10)6-2-1-3(8)9/h6-8H,1-2H2
charge 0 multiplicity 1
17 atoms
F  4.005761 0.882329 0.079766
O  -3.603097 1.261798 -0.016252
O  -3.287648 -1.009827 -0.38548
O  1.557582 0.546172 -1.067507
N  0.839587 -0.637226 0.83177
N  3.069071 -0.037283 0.744288
C  -0.523543 -0.883217 0.332103
C  -1.397802 0.390071 0.382026
C  -2.82108 0.100728 -0.04594
C  1.776047 0.006841 0.042526
H  -0.459788 -1.2393 -0.709897
H  -0.979256 -1.6910 0.92913
H  -0.972494 1.16483 -0.281697
H  -1.419522 0.825319 1.399072
H  1.054726 -0.787966 1.818796
H  3.541646 -0.957687 0.656901
H  -4.52979 1.043917 -0.309104
