program: Gaussian 09
title: 000161762
version: EM64L-G09RevD.01
frameworkgroup: C1[X(C11H16)]
method: RPBEPBE
basis: SDD
operation: Freq
keyword: #p
keyword: freq=noraman
keyword: PBEPBE/SDD
title: #p freq=noraman PBEPBE/SDD
converged: YES YES NO NO
title: Mulliken charges:
elementType: C C C C C C C C C C C H H H H H H H H H H H H H H H H
charge: -0.198459 -0.482695 -0.191339 -0.188135 -0.195875 -0.478630 -0.166462 -0.180476 -0.183737 -0.437535 -0.671274 0.193067 0.207268 0.219756 0.203391 0.253463 0.203481 0.223812 0.216645 0.187858 0.193801 0.215670 0.208887 0.201967 0.214340 0.209540 0.221668
chargesum: 0.00000
title: Mulliken charges with hydrogens summed into heavy atoms:
elementType: C C C C C C C C C C C
charge: -0.005392 -0.055670 0.012053 0.065328 0.007606 -0.038172 0.021396 0.013325 0.031933 -0.026681 -0.025725
polarizability: 1.55581625e+02 1.26667801e+00 9.93490200e+01 1.59431887e+01 -1.02716357e+00 9.71443635e+01
1716.lowfreq: -10.6982 -6.4373 -0.0001 0.0004 0.0005 5.6413 27.0177 45.4246 92.2896
frequency: 26.9195 44.8143 92.2629 98.3069 116.2577 179.2536 221.2052 247.2407 308.6396 355.8282 372.7644 393.9785 460.2923 466.2263 503.9695 655.7530 713.2252 752.8305 760.1075 793.9530 823.8107 839.9828 854.4733 894.6995 909.9094 932.9510 952.3752 970.4278 977.1492 983.9109 1019.2021 1065.0529 1071.4079 1087.0037 1111.0746 1129.7317 1202.3857 1207.3354 1228.0541 1241.7040 1246.4726 1260.2913 1285.1296 1296.9500 1302.2911 1339.6274 1345.1213 1370.2415 1387.3943 1388.2483 1403.3036 1440.7667 1461.1415 1464.2795 1474.5468 1484.8405 1671.5805 1687.1011 1692.4470 2915.5630 2957.4366 2961.2573 2961.9860 2976.2975 2976.9906 3024.5592 3033.7034 3058.6655 3061.6194 3072.6983 3072.9158 3081.3474 3092.8572 3097.9094 3108.6202
redmass: 2.6742 2.8599 2.3621 2.4793 2.4858 1.6174 2.4384 1.4890 2.7208 3.0208 3.1580 2.8755 2.7940 2.8646 2.5537 1.4182 1.4283 1.6760 3.7148 1.6175 2.6683 2.2796 3.5356 2.2703 2.0515 1.7533 2.1475 1.1960 1.1621 1.3146 2.0761 1.9914 1.7350 1.9973 2.6477 1.9037 1.1200 1.2858 1.1391 1.1227 1.1108 1.1612 1.2861 1.3790 1.3836 1.4269 1.2845 1.6572 1.2115 1.5462 1.4243 1.0846 1.0925 1.0740 1.0433 1.0621 6.7716 7.2741 6.7816 1.0665 1.0885 1.0748 1.0626 1.0452 1.0608 1.0960 1.0975 1.0921 1.0830 1.0980 1.0851 1.1009 1.0896 1.0954 1.0971
irintensity: 0.2647 0.1551 0.1075 0.4673 0.4166 0.2674 0.4972 0.3307 0.1097 2.4001 2.2494 0.6234 5.6118 4.7445 3.0251 50.3256 36.2538 10.9231 1.0492 7.9505 12.1440 1.4076 5.4837 2.4239 10.7195 13.1038 3.0367 19.6716 28.6144 1.0806 4.5627 1.7322 4.8106 7.8923 2.7245 5.4389 1.4396 0.6882 1.8908 1.2834 0.6898 2.5097 0.6055 1.2096 0.6331 3.2318 0.4790 1.0212 10.2948 0.4384 1.9148 17.8971 8.1104 7.8799 10.8810 10.6691 0.5862 7.8899 1.5888 40.1845 20.5359 12.9996 42.1500 40.6434 64.1329 6.4802 29.2911 12.1488 11.5329 52.9778 27.8913 52.1191 20.0010 87.7500 41.3454
temp: 298.150 k
press: 1.00000 atm
elementType: 6 6 6 6 6 6 6 6 6 6 6 1 1 1 1 1 1 1 1 1 1 1 1 1 1 1 1
symmnumber: 1
zpe: 619203.1 jmol-1
zpe.correction: 0.235842 hartree
zpe.thermalcorrener: 0.247750 hartree
zpe.thermalcorrenthalpy: 0.248694 hartree
zpe.thermalcorrgfe: 0.196703 hartree
zpe.sumelectzpe: -427.855441 hartree
zpe.sumelectthermal: -427.843533 hartree
zpe.sumelectthermalent: -427.842589 hartree
zpe.sumelectthermalfe: -427.894580 hartree
dipole: -0.1251 -0.0073 -0.1075
dipole: 0.1651
quadrupole: -64.1342 -67.2714 -66.2064
quadrupole: 0.2128 2.9198 -1.2270
quadrupole: 1.7364 -1.4007 -0.3357 0.2128 2.9198 -1.2270
hfenergy: -428.0912828 hartree
pointgroup: C01 [X(C11H16)]
dipole: 0.0490081 0.0032426 -0.0424957 debye
polarizability: 155.3971368|2.3722286|99.4773959|-16.1671353|0.5587428|97.2004757 unknown
InChI: InChI=1S/C11H16/c1-2-3-8-11-9-6-4-5-7-10-11/h3-4,6-8,10-11H,2,5,9H2,1H3
charge 0 multiplicity 1
27 atoms
C  0.182966 0.421178 0.9362
C  0.91972 -0.896403 1.330761
C  1.110814 1.508654 0.401445
C  -0.952397 0.167765 -0.050079
C  1.539084 -1.680349 0.186408
C  2.955067 0.188578 -0.924387
C  2.244135 1.396967 -0.343061
C  2.397022 -1.211569 -0.757307
C  -2.260657 0.451517 0.182573
C  -3.395491 0.200738 -0.790717
C  -4.476165 -0.749708 -0.213434
H  -0.273429 0.81959 1.866583
H  0.196505 -1.546218 1.858153
H  1.706799 -0.632741 2.066952
H  0.783332 2.531453 0.64243
H  -0.65033 -0.266562 -1.014715
H  1.274176 -2.746553 0.134909
H  4.004054 0.189483 -0.545164
H  3.071056 0.3805 -2.013766
H  2.741239 2.343658 -0.610708
H  2.778556 -1.934581 -1.495018
H  -2.547162 0.889582 1.153778
H  -2.990958 -0.21867 -1.731919
H  -3.877023 1.165805 -1.054211
H  -5.305538 -0.891387 -0.930912
H  -4.903198 -0.342369 0.722323
H  -4.043979 -1.740157 0.016684
