program: Gaussian 09
title: 000161730
version: EM64L-G09RevD.01
frameworkgroup: C1[X(C9H16N2O5)]
method: RPBEPBE
basis: SDD
operation: Freq
keyword: #p
keyword: freq=noraman
keyword: PBEPBE/SDD
title: #p freq=noraman PBEPBE/SDD
converged: YES YES NO NO
title: Mulliken charges:
elementType: O O O O O N N C C C C C C C C C H H H H H H H H H H H H H H H H
charge: -0.268196 -0.447349 -0.439113 -0.437865 -0.309745 -0.162007 -0.406913 -0.020174 -0.498147 -0.131681 -0.032034 -0.371007 -0.418168 -0.349259 -0.141253 0.266865 0.294412 0.230898 0.270029 0.209959 0.239291 0.245799 0.238902 0.238192 0.230718 0.195831 0.186629 0.231761 0.329089 0.337089 0.344965 0.342480
chargesum: 0.00000
title: Mulliken charges with hydrogens summed into heavy atoms:
elementType: O O O O O N N C C C C C C C C C
charge: -0.268196 -0.110260 -0.094148 -0.095385 -0.309745 -0.162007 -0.077824 0.274238 0.002781 0.078278 0.207257 0.113694 0.050742 0.033201 0.090508 0.266865
polarizability: 1.52426845e+02 -4.23841529e-01 1.24527236e+02 -3.44948025e-01 6.62674794e+00 1.00283344e+02
1716.lowfreq: -12.8130 -8.3874 0.0005 0.0005 0.0010 5.0296 19.3608 39.5466 47.7357
frequency: 19.2559 39.5273 47.7106 72.5127 78.8988 123.7623 134.6496 170.7131 180.0052 195.4773 215.3436 242.1991 254.8515 276.6658 322.6815 332.6952 367.0184 413.2513 437.1888 454.2793 497.5045 509.8947 537.5392 548.9227 564.4312 619.8942 706.9800 716.5645 735.4108 775.4755 808.2338 854.3840 865.2260 889.1972 904.4270 921.1228 947.1093 972.1842 979.7834 996.6026 1022.1644 1036.8187 1049.8452 1070.7947 1082.0993 1094.0729 1146.8077 1156.6776 1163.9269 1184.0589 1197.6397 1204.5965 1212.8983 1226.6554 1246.6050 1265.7219 1285.4332 1292.3001 1299.7645 1314.9604 1328.3755 1331.6089 1351.4368 1357.7004 1369.9126 1377.5874 1407.9467 1425.7603 1435.5238 1445.2765 1451.2795 1455.6615 1474.4184 1633.4003 2922.0720 2972.1974 2977.1447 2988.4250 2990.5112 2995.2503 3027.8347 3032.3779 3065.2513 3067.1474 3102.9832 3110.3827 3559.5593 3559.7014 3561.9005 3573.6789
redmass: 5.8270 4.4192 6.2438 3.7933 3.4305 8.4064 5.6650 1.4675 2.9954 2.6107 1.1502 1.4972 2.0765 3.0063 3.8561 3.9317 3.5279 3.4026 4.7484 2.7720 3.1085 4.3781 2.5646 4.8030 1.3471 4.4273 5.9686 6.9696 2.5476 4.6877 4.2284 3.2023 3.4249 3.1344 2.6709 2.6817 2.8331 3.4028 2.3988 2.7708 2.4108 2.7483 2.3046 1.8625 2.2319 2.0316 1.2899 1.5794 1.1658 1.6180 1.5360 1.2101 1.2078 1.6867 1.3656 1.9536 1.2665 1.3203 1.4627 1.3556 1.2770 1.3446 1.5375 1.4998 1.5691 1.4961 1.4826 1.6990 1.7134 1.2007 1.1062 1.0833 1.2565 5.4875 1.0573 1.0876 1.0894 1.0665 1.0815 1.0965 1.0646 1.0637 1.0974 1.0872 1.1035 1.1015 1.0666 1.0663 1.0768 1.0667
irintensity: 0.1464 1.5439 3.3553 7.2573 6.1915 5.4705 0.1804 79.5004 24.8764 72.0123 178.7934 79.8367 54.5400 26.9779 16.7319 6.6396 15.8217 1.3810 17.5851 9.1088 5.6888 18.2752 37.7956 8.9203 70.2401 2.4692 29.9641 10.0103 19.5151 2.7022 35.1405 125.6765 31.6355 26.5891 161.2648 57.6581 20.3081 38.1617 52.1432 22.0607 51.2760 94.4396 21.4112 30.0921 4.3301 3.7766 24.7932 50.4246 35.8941 16.6300 32.9632 11.5169 44.0916 139.1050 47.7466 49.2800 25.6773 18.5053 132.7920 34.6931 26.8913 2.0871 1.4629 5.4863 11.8219 6.5655 1.2092 33.0170 134.7693 48.3069 18.5160 5.4260 98.6341 372.0326 54.7152 39.9482 29.3470 49.6242 44.6287 111.2637 25.6277 25.8037 14.8932 4.3262 17.1398 10.2004 7.3181 4.5964 33.6328 4.1592
temp: 298.150 k
press: 1.00000 atm
elementType: 8 8 8 8 8 7 7 6 6 6 6 6 6 6 6 6 1 1 1 1 1 1 1 1 1 1 1 1 1 1 1 1
symmnumber: 1
zpe: 679692.6 jmol-1
zpe.correction: 0.258881 hartree
zpe.thermalcorrener: 0.275495 hartree
zpe.thermalcorrenthalpy: 0.276439 hartree
zpe.thermalcorrgfe: 0.213230 hartree
zpe.sumelectzpe: -836.891815 hartree
zpe.sumelectthermal: -836.875201 hartree
zpe.sumelectthermalent: -836.874257 hartree
zpe.sumelectthermalfe: -836.937466 hartree
dipole: -0.3299 4.0039 3.2216
dipole: 5.1497
quadrupole: -67.6169 -98.8209 -101.5262
quadrupole: -3.1450 -9.0690 -1.6053
quadrupole: 21.7044 -9.4996 -12.2049 -3.1450 -9.0690 -1.6053
hfenergy: -837.1506964 hartree
pointgroup: C01 [X(C9H16N2O5)]
dipole: 0.0502496 -1.6111855 1.2273343 debye
polarizability: 152.317203|-1.7876185|124.9558254|0.045043|-6.0160244|99.964397 unknown
InChI: InChI=1S/C9H16N2O5/c12-4-6-5(13)3-8(16-6)11-2-1-7(14)10-9(11)15/h5-8,10,12-14H,1-4H2
charge 0 multiplicity 1
32 atoms
O  1.324735 -0.313158 -0.807487
O  3.205385 2.016075 0.448288
O  3.307668 -2.541277 -1.056276
O  -4.030771 -0.568963 1.277243
O  -1.543722 2.245899 -1.198329
N  -0.845236 0.327849 -0.020719
N  -3.116211 0.624219 -0.665665
C  0.544063 0.742553 -0.071531
C  1.272269 0.86474 1.285451
C  2.746345 0.690879 0.89675
C  2.702866 -0.342129 -0.273132
C  -1.192364 -0.959682 0.627588
C  -2.373705 -1.629199 -0.092602
C  3.075144 -1.762019 0.164936
C  -3.554855 -0.652784 -0.127233
C  -1.802216 1.128521 -0.655417
H  0.584825 1.689303 -0.634902
H  0.957856 0.063456 1.977773
H  1.100415 1.84367 1.75864
H  3.378979 0.33562 1.736109
H  3.396218 -0.042401 -1.086047
H  -1.461864 -0.799448 1.689424
H  -0.301142 -1.607779 0.569393
H  -2.092693 -1.90623 -1.123716
H  -2.679473 -2.536699 0.453595
H  2.251672 -2.190142 0.775717
H  4.001823 -1.726354 0.781539
H  -4.381487 -1.032385 -0.760653
H  -3.77514 1.233405 -1.152632
H  4.072194 1.925896 -0.022953
H  3.367202 -3.503542 -0.833167
H  -4.635479 0.211705 1.364612
