program: Gaussian 09
title: 000161706
version: EM64L-G09RevD.01
frameworkgroup: C1[X(C6H13NO4)]
method: RPBEPBE
basis: SDD
operation: Freq
keyword: #p
keyword: freq=noraman
keyword: PBEPBE/SDD
title: #p freq=noraman PBEPBE/SDD
converged: NO YES NO NO
title: Mulliken charges:
elementType: O O O O N C C C C C C H H H H H H H H H H H H H
charge: -0.457667 -0.465354 -0.427715 -0.158109 -0.691483 -0.133705 -0.129561 -0.120648 -0.130500 -0.708291 -0.107226 0.239964 0.236270 0.208727 0.228558 0.234399 0.272515 0.201173 0.329812 0.311034 0.394008 0.153116 0.349640 0.371044
chargesum: 0.00000
title: Mulliken charges with hydrogens summed into heavy atoms:
elementType: O O O O N C C C C C C
charge: -0.063659 -0.115715 -0.056672 -0.158109 -0.050637 0.106259 0.106710 0.088079 0.098058 -0.000205 0.045890
polarizability: 9.98105748e+01 1.53385971e+00 8.08561699e+01 3.31583330e+00 1.83700536e-01 7.52653512e+01
1716.lowfreq: -13.2852 0.0011 0.0011 0.0013 9.9507 15.8520 40.4186 71.0020 83.9547
frequency: 40.2819 70.9728 83.8300 109.1102 151.8467 217.9807 236.9062 248.7585 261.5348 280.5931 300.9366 310.6411 330.5465 351.4960 360.2241 424.9363 462.9501 577.6979 618.4178 688.6185 742.4276 785.1027 802.3956 850.1227 875.5386 902.0451 905.4787 947.6816 973.9580 1006.3401 1028.5201 1052.0180 1076.8191 1080.7177 1098.3580 1176.9282 1198.5117 1225.7582 1231.4521 1260.6001 1297.4193 1313.7711 1342.5010 1364.4916 1370.7462 1378.8922 1383.4799 1406.6062 1426.6449 1465.7128 1476.5545 1641.9628 1650.9502 2821.9576 2957.6529 2970.9402 2985.7507 3002.3374 3021.4918 3034.2417 3077.7530 3102.8380 3428.4554 3494.0163 3538.8940 3571.1648
redmass: 5.7788 5.3489 4.2683 5.1345 3.3736 4.2499 1.1672 3.9950 3.1998 2.6501 2.0274 1.5418 2.8638 3.4319 1.3009 2.7943 1.3195 4.1629 2.6078 3.8390 3.8069 3.9316 2.9328 1.4792 2.6875 1.3370 2.0664 2.2814 2.5829 2.2158 2.0484 2.6129 1.7002 2.1898 1.9609 1.2508 1.3200 1.1911 1.3809 1.3879 1.4035 1.3298 1.3987 1.3695 1.1681 1.3486 1.4701 1.2255 1.2369 1.0440 1.0759 3.7628 1.2782 1.0834 1.0833 1.0828 1.0408 1.0779 1.0804 1.0762 1.0972 1.0995 1.0467 1.0644 1.0953 1.0663
irintensity: 1.7664 3.5240 3.9432 1.4960 1.1736 11.1506 0.1044 8.4630 32.7202 3.9588 72.2287 46.8426 19.3854 7.8273 23.7853 6.6731 118.7307 5.7128 8.0751 25.8260 12.9091 33.0096 10.8005 55.0900 127.4565 151.7032 14.2805 41.4016 9.5404 35.1281 20.9776 58.4995 64.8435 58.7029 19.0428 18.7344 40.4061 12.7808 28.7404 16.5677 3.5455 2.6141 3.4346 2.7667 71.3900 4.7201 5.0526 21.0705 124.0158 11.6772 8.0670 160.1026 50.2465 122.9862 21.6382 52.2091 20.7068 123.5344 65.2694 112.5834 28.7731 19.3349 9.6696 24.1584 16.2813 3.9649
temp: 298.150 k
press: 1.00000 atm
elementType: 8 8 8 8 7 6 6 6 6 6 6 1 1 1 1 1 1 1 1 1 1 1 1 1
symmnumber: 1
zpe: 513654.2 jmol-1
zpe.correction: 0.195641 hartree
zpe.thermalcorrener: 0.208509 hartree
zpe.thermalcorrenthalpy: 0.209453 hartree
zpe.thermalcorrgfe: 0.156687 hartree
zpe.sumelectzpe: -591.132991 hartree
zpe.sumelectthermal: -591.120123 hartree
zpe.sumelectthermalent: -591.119179 hartree
zpe.sumelectthermalfe: -591.171945 hartree
dipole: -6.0091 1.0954 -1.8260
dipole: 6.3752
quadrupole: -71.9805 -69.6031 -66.0244
quadrupole: 4.1905 -2.1944 0.3543
quadrupole: -2.7778 -0.4004 3.1783 4.1905 -2.1944 0.3543
hfenergy: -591.328632 hartree
pointgroup: C01 [X(C6H13N1O4)]
dipole: -2.3232062 0.9002565 0.2886506 debye
dipolederiv: -0.7592664 0.0039541 0.0542238 -0.227078 -0.6425628 -0.1191953 0.0233879 -0.1174825 -0.5092227 -0.6387338 0.0296607 0.2988479 0.0383553 -0.5731847 -0.1183388 0.320782 -0.1258443 -0.5110659 -0.7152074 0.0881564 0.1226997 0.1488991 -0.2531104 -0.0276052 0.0910902 -0.0081243 -0.6527364 -0.4810712 0.196723 -0.101179 0.3780316 -0.5469517 0.2446075 -0.0862869 0.0798684 -0.4577209 -0.4872356 0.0471439 0.1008399 0.0166409 -0.6019143 0.0202449 0.1914912 0.0697763 -0.5023877 0.0483089 0.0664382 0.010579 0.0164887 0.3026744 -0.0323007 -0.0965301 -0.1408114 0.2308004 0.471211 0.0229133 0.2801506 0.2959195 0.4506949 0.1328739 0.1212085 0.0552571 0.2203422 0.6221052 -0.0310751 -0.2018704 -0.059272 0.3857952 0.0835454 -0.1391638 0.0613463 0.4494767 0.1837823 0.0319102 -0.3480613 0.0045726 0.1996165 0.1596859 -0.3779269 0.0861826 0.0694886 -0.0288766 -0.0498261 -0.0114953 -0.0363756 -0.0511787 -0.125515 0.0398668 -0.12129 -0.1461509 0.3165692 -0.3730005 0.0073403 -0.6359726 0.5334421 -0.2252139 0.1993276 -0.0895464 0.7748076 0.0454529 -0.0640861 -0.0372581 -0.0361043 -0.1298475 -0.0627435 -0.0478033 -0.0928752 -0.0568246 0.0105166 0.0387939 -0.0847378 0.0048147 -0.0554984 0.061089 -0.0643873 0.1040323 -0.0756334 -0.0173093 -0.0250705 0.0376771 -0.0521067 -0.1653672 0.0729784 0.0369217 0.0622098 -0.0425163 0.0887944 0.0049393 0.0373787 0.0215218 -0.1081582 -0.0500456 0.0099974 -0.0261128 0.0228165 0.1028948 -0.0231694 -0.000486 -0.0429893 -0.0791669 0.0443611 0.0275465 0.0956895 0.0457969 0.0510344 -0.0065401 0.122454 -0.0057156 0.0909174 -0.0118267 0.1130952 -0.0146219 0.0162526 -0.1443654 0.0611934 -0.1261428 0.1008593 0.046797 0.0329385 -0.0860918 0.0146435 0.0483051 0.1698864 -0.0454616 0.0565619 0.0003537 0.2745294 -0.0096063 0.0773255 0.0264082 0.2118984 0.1821959 -0.019617 -0.0983504 -0.0237601 0.2152094 -0.0112229 -0.1270148 0.0533282 0.1060287 0.437329 -0.0350244 -0.1184793 -0.0065295 0.2765403 0.0080929 -0.1896121 0.0359666 0.392368 0.0254005 0.1163045 0.1372825 0.1283047 -0.0628205 -0.1142383 0.1317674 -0.096414 -0.1900692 0.094018 0.0364263 -0.1121557 0.0292252 0.3619873 0.058604 -0.1783425 0.0631677 0.2034484 0.422566 -0.0716863 -0.0258194 -0.0580835 0.1315575 -0.0111694 0.0093517 0.0252464 0.3524978 unknown
polarizability: 98.6369518|-5.5382025|76.1632558|2.7291767|-1.1818013|81.1318882 unknown
InChI: InChI=1S/C6H13NO4/c1-3(9)5(7)6(11)4(10)2-8/h2-6,9-11H,7H2,1H3
charge 0 multiplicity 1
24 atoms
O  0.381016 -1.128732 -1.184877
O  -3.185073 0.759412 0.701581
O  2.729454 0.295059 -1.163213
O  2.679058 -1.02548 1.370097
N  -0.998676 -0.943309 0.996478
C  -0.859371 0.371224 0.310357
C  0.314671 0.24912 -0.718706
C  -2.190505 0.718093 -0.399371
C  1.736111 0.651636 -0.171203
C  -2.63404 -0.260082 -1.50136
C  2.011321 0.018999 1.193101
H  -0.659636 1.202094 1.019671
H  0.13556 0.896643 -1.598367
H  -2.078786 1.735957 -0.830742
H  1.779629 1.75228 -0.062968
H  -2.813864 -1.267704 -1.089002
H  -1.865944 -0.353978 -2.287326
H  -3.568932 0.098435 -1.973616
H  -1.972944 -1.093011 1.291329
H  -0.361053 -1.066556 1.792815
H  -0.129072 -1.629137 -0.450918
H  1.545312 0.560871 2.061513
H  -4.08675 0.904114 0.318781
H  2.550513 -0.654248 -1.406555
