program: Gaussian 09
title: 000161687
version: EM64L-G09RevD.01
frameworkgroup: C1[X(C22H21ClN4O3)]
method: RPBEPBE
basis: SDD
operation: Freq
keyword: #p
keyword: freq=noraman
keyword: PBEPBE/SDD
title: #p freq=noraman PBEPBE/SDD
converged: YES YES NO NO
title: Mulliken charges:
elementType: Cl O O O N N N N C C C C C C C C C C C C C C C C C C C C C C H H H H H H H H H H H H H H H H H H H H H
charge: -0.015644 -0.288461 -0.215650 -0.214928 -0.131617 -0.100678 -0.100708 0.017402 -0.495681 -0.400795 0.447764 -0.260455 -0.660550 -0.323818 -0.332576 -0.310518 -0.369894 0.141801 0.391364 -0.348538 -0.387538 -0.220404 -0.194628 0.280238 -0.253755 -0.252980 -0.246635 0.408974 -0.375032 -0.366161 0.253288 0.232162 0.265014 0.228486 0.237668 0.215914 0.225209 0.238781 0.219471 0.237467 0.228052 0.286471 0.250415 0.245992 0.245251 0.227355 0.230740 0.232017 0.285150 0.309463 0.285735
chargesum: 0.00000
title: Mulliken charges with hydrogens summed into heavy atoms:
elementType: Cl O O O N N N N C C C C C C C C C C C C C C C C C C C C C C
charge: -0.015644 -0.288461 -0.215650 -0.214928 -0.131617 -0.100678 -0.100708 0.017402 -0.010231 0.092705 0.447764 0.193127 0.022911 -0.086351 -0.104523 -0.024047 -0.119479 0.141801 0.391364 -0.102546 -0.142287 0.006951 0.036112 0.280238 -0.021738 -0.252980 0.038515 0.408974 -0.065569 -0.080425
polarizability: 8.21406162e+02 1.03298061e+02 2.79969803e+02 -2.22338944e+01 4.26039793e+01 2.14746879e+02
1716.lowfreq: -1.0216 -0.0014 -0.0013 0.0003 3.4940 4.1338 8.4258 9.7698 27.8389
frequency: 8.3365 9.5728 27.8293 28.8500 35.0025 45.3390 54.9758 61.7177 66.2645 86.1150 96.2690 123.1881 128.7051 146.6355 165.8875 168.7245 172.2100 184.8671 203.2543 213.2560 231.1584 236.9063 294.0721 317.1463 331.7137 350.7082 374.0057 378.1387 389.2935 409.8111 411.1383 432.6982 440.4567 461.8818 465.9940 502.3708 504.8060 515.5137 536.9933 542.9574 558.5437 570.5406 600.4136 609.9885 630.8091 634.4231 679.0833 689.9416 691.9159 713.1626 737.0265 754.5726 759.2598 760.6314 783.6746 791.7647 804.2312 822.6313 835.1903 848.5793 863.8261 868.3496 890.9066 896.5836 917.7529 920.2922 935.8163 962.6645 964.1226 983.0800 984.1123 984.9949 992.3190 1002.8122 1007.4870 1022.3851 1022.8707 1040.1570 1069.5886 1084.1703 1084.5545 1098.7849 1116.1686 1126.2555 1140.5723 1161.0238 1168.5140 1178.7945 1190.8504 1192.8075 1200.9006 1211.5723 1216.2198 1237.6950 1264.5879 1272.5192 1283.6194 1305.8949 1314.4869 1317.4576 1341.9026 1351.2256 1362.8717 1367.6367 1373.5860 1389.3159 1390.2504 1392.8906 1401.1250 1417.3136 1443.7924 1445.1740 1464.5362 1468.0372 1468.7481 1478.3528 1483.1124 1484.1869 1504.6923 1521.1747 1541.4906 1564.3937 1588.5536 1593.8860 1611.5705 1624.0900 2956.6443 2986.9273 3013.2112 3021.9438 3030.2917 3070.7359 3074.8743 3085.6827 3098.6163 3131.3064 3139.3181 3148.4094 3155.5494 3155.8871 3162.8313 3163.9603 3172.7999 3173.8051 3177.3073 3187.3470 3190.4097
redmass: 9.3443 6.9023 6.3750 4.8057 4.7737 5.5991 9.6334 3.5087 7.0607 5.9220 3.5241 5.7050 5.5670 5.9395 5.4498 5.1277 4.3948 5.6818 4.3945 1.2273 4.6728 5.5074 3.3593 6.6698 7.0712 5.1922 3.7642 5.4048 6.5602 4.1409 2.9286 3.4298 3.7249 3.8263 2.8740 2.9053 5.0821 3.3756 4.3896 4.0226 3.2115 5.4082 3.7394 6.4393 6.8506 7.0949 5.6826 6.2541 2.0935 6.8580 4.1243 4.1482 1.6774 3.8550 2.4590 1.6894 1.2772 1.2539 1.6882 7.0284 1.5082 2.9033 1.4495 7.3608 3.0378 1.4277 2.0575 1.3681 1.3451 5.1481 2.9250 1.3099 1.3371 1.3405 2.7641 2.7383 2.1055 3.0948 1.9456 1.5295 1.9517 3.2912 1.5267 1.5104 1.8368 1.6253 1.0997 1.1967 2.3619 2.8256 2.6068 3.1156 1.1657 1.7540 1.4263 2.7557 1.2323 1.9882 1.3357 2.5685 1.3170 6.6968 1.3524 1.5470 3.8852 5.2659 4.0242 1.3611 2.0335 6.2021 2.3219 2.7096 2.0532 1.3219 1.0709 1.4621 1.6158 1.1147 1.6888 1.6951 5.2936 8.9573 7.1613 6.4304 6.3182 6.4215 1.0575 1.0358 1.0679 1.0639 1.0975 1.1010 1.1012 1.1004 1.1015 1.0848 1.0887 1.0878 1.0921 1.0872 1.0959 1.0885 1.0948 1.1012 1.0960 1.0954 1.0934
irintensity: 0.1023 0.3505 0.0180 0.2836 0.6399 0.4831 0.7198 0.3087 1.4839 2.3488 0.2261 2.3469 2.4638 2.3547 0.6889 0.6303 7.9102 1.3799 1.8034 1.5972 2.6221 0.3169 0.5848 0.7279 1.9748 4.3581 0.9390 6.2693 1.6360 0.6397 0.1054 5.5033 1.9400 3.9441 2.2390 11.2820 9.0492 10.2767 4.4490 18.1637 6.1026 2.5683 12.2534 0.4820 3.6962 0.2348 13.1312 17.2964 34.4196 21.1145 4.3760 1.4827 98.5776 15.2347 3.0038 26.5645 8.4733 0.3967 59.2359 84.7018 37.9518 15.2277 9.4101 1.3024 44.9208 31.9453 15.3678 0.2203 1.8764 4.7412 2.3749 0.9820 3.4555 0.0228 107.4292 38.4950 29.8295 21.5313 48.4315 19.0963 33.1402 26.9332 216.1132 6.6790 61.1743 624.8047 17.5415 82.6961 218.8700 836.5680 828.8814 175.1941 2.4437 86.2240 193.7615 12.9281 3.6636 416.9956 0.3819 510.0622 16.6275 74.9844 91.9988 3.0396 13.5947 67.2402 19.7649 8.9689 149.8002 46.0700 2.5623 24.2864 12.6479 107.1748 28.2453 7.3014 44.0893 11.2566 67.3618 33.1409 69.0121 34.6147 326.6998 28.1336 132.6363 626.1780 28.1617 33.0063 20.9659 26.8860 108.9938 4.9259 9.4699 37.1572 43.4722 5.0942 7.1261 4.9492 34.6667 2.8555 22.3442 1.6922 22.5723 7.7474 33.8507 0.9416 5.9166
temp: 298.150 k
press: 1.00000 atm
elementType: 17 8 8 8 7 7 7 7 6 6 6 6 6 6 6 6 6 6 6 6 6 6 6 6 6 6 6 6 6 6 1 1 1 1 1 1 1 1 1 1 1 1 1 1 1 1 1 1 1 1 1
symmnumber: 1
zpe: 1024604.4 jmol-1
zpe.correction: 0.390251 hartree
zpe.thermalcorrener: 0.417746 hartree
zpe.thermalcorrenthalpy: 0.418690 hartree
zpe.thermalcorrgfe: 0.326741 hartree
zpe.sumelectzpe: -1753.396370 hartree
zpe.sumelectthermal: -1753.368875 hartree
zpe.sumelectthermalent: -1753.367931 hartree
zpe.sumelectthermalfe: -1753.459880 hartree
dipole: 13.8147 1.8398 -2.3233
dipole: 14.1290
quadrupole: -244.5794 -172.3798 -174.6345
quadrupole: -9.8438 -0.0490 3.9863
quadrupole: -47.3815 24.8181 22.5634 -9.8438 -0.0490 3.9863
hfenergy: -1753.7866209 hartree
pointgroup: C01 [X(C22H21Cl1N4O3)]
dipole: 5.4997484 0.5246193 -0.6143928 debye
polarizability: 835.9093812|49.407147|224.808751|18.7512438|50.3332845|255.4047117 unknown
InChI: InChI=1S/C22H21ClN4O3/c1-2-26(14-15-30-20-6-4-3-5-7-20)18-10-8-17(9-11-18)24-25-22-13-12-19(27(28)29)16-21(22)23/h3-13,16H,2,14-15H2,1H3
charge 0 multiplicity 1
51 atoms
Cl -4.928113 1.665347 2.61802
O  5.628347 -0.147782 -0.192157
O  -9.013191 -1.021771 -1.510743
O  -9.467795 -0.099632 0.529482
N  3.211296 1.659322 -0.038296
N  -2.314055 0.565914 -0.669178
N  -3.124724 0.83846 0.341262
N  -8.650884 -0.428024 -0.418952
C  4.144176 1.482771 -1.166126
C  3.801111 2.145013 1.235509
C  1.852709 1.3971 -0.172937
C  4.69258 0.053798 -1.307335
C  3.730039 3.680912 1.390341
C  0.933092 1.664936 0.906428
C  1.307024 0.850945 -1.387509
C  -0.429602 1.404411 0.78069
C  -0.062189 0.597256 -1.507032
C  -0.961289 0.863081 -0.43367
C  6.255159 -1.4068 -0.079617
C  6.038675 -2.485755 -0.971063
C  7.148228 -1.542496 1.011034
C  6.725388 -3.704352 -0.75675
C  7.824691 -2.762245 1.209196
C  -4.481739 0.509926 0.088113
C  7.617409 -3.851633 0.327118
C  -5.44568 0.834572 1.090578
C  -4.951556 -0.139993 -1.096624
C  -7.220706 -0.107506 -0.249263
C  -6.80645 0.53569 0.938121
C  -6.304354 -0.450183 -1.273511
H  5.000738 2.164036 -1.018371
H  3.658587 1.780032 -2.112906
H  4.849916 1.805133 1.254513
H  3.30077 1.64314 2.082397
H  3.874522 -0.691734 -1.260369
H  5.228753 -0.052884 -2.273895
H  4.19304 3.988352 2.345698
H  2.686847 4.041371 1.379128
H  4.272814 4.186807 0.571353
H  1.299473 2.093704 1.842458
H  1.955755 0.61636 -2.235322
H  -1.122374 1.614604 1.601455
H  -0.475144 0.180169 -2.431655
H  5.352385 -2.397258 -1.818584
H  7.296536 -0.69141 1.683047
H  6.556548 -4.540031 -1.445035
H  8.514316 -2.863545 2.054396
H  8.143582 -4.798545 0.485155
H  -4.205342 -0.384548 -1.858013
H  -7.541489 0.786169 1.706206
H  -6.67283 -0.947703 -2.173985
