program: Gaussian 09
title: 000161684
version: EM64L-G09RevD.01
frameworkgroup: C1[X(C19H24O2)]
method: RPBEPBE
basis: SDD
operation: Freq
keyword: #pfreq=noraman
keyword: PBEPBE/SDD
title: #p freq=noraman PBEPBE/SDD
converged: NO YES NO NO
title: Mulliken charges:
elementType: O O C C C C C C C C C C C C C C C C C C C H H H H H H H H H H H H H H H H H H H H H H H H
charge: -0.258995 -0.244875 0.355569 -0.220377 -0.421735 -0.548527 -0.440929 0.633870 -0.759125 -0.772063 -0.482770 -0.641067 -0.265349 0.300532 -0.662716 0.440507 -0.358768 -0.382735 -0.223871 -0.230678 -0.243019 0.238046 0.228682 0.220328 0.238176 0.209104 0.211914 0.200433 0.246430 0.212009 0.213102 0.213574 0.224282 0.221659 0.205977 0.231386 0.235055 0.236031 0.240453 0.238646 0.255367 0.224882 0.226171 0.227426 0.227990
chargesum: 0.00000
title: Mulliken charges with hydrogens summed into heavy atoms:
elementType: O O C C C C C C C C C C C C C C C C C C C
charge: -0.258995 -0.244875 0.355569 0.017669 -0.193054 -0.090023 -0.019911 0.633870 -0.100254 -0.121106 -0.261111 -0.203703 0.205737 0.300532 -0.183617 0.440507 -0.103401 -0.157852 0.002300 -0.003252 -0.015029
polarizability: 2.10457784e+02 1.04052420e+01 2.06864792e+02 2.49546711e+01 -6.44964927e+00 1.73469938e+02
1716.lowfreq: -6.2275 -0.0004 -0.0003 0.0004 1.8593 7.6614 9.6882 13.1753 25.6597
frequency: 6.3898 13.1461 24.4328 28.9166 42.5160 81.0405 98.3816 132.0751 150.7013 176.5570 187.1510 204.6266 212.1454 246.2690 250.8038 298.7244 306.2152 326.9186 366.8113 377.5600 392.2146 402.8239 405.2445 439.1814 456.2377 467.4516 482.6618 520.1078 589.8183 598.2794 614.9747 618.8155 672.7759 696.4135 710.7645 755.7400 762.8104 774.7826 803.3107 808.5087 832.2108 845.8897 851.5506 881.8242 897.8505 911.5427 923.7902 934.1007 939.7352 945.1923 953.0110 962.1766 966.3833 974.9906 989.7497 991.6726 994.6041 1001.6689 1027.7284 1045.6665 1054.8890 1072.4712 1076.5900 1083.9054 1095.0531 1106.3846 1127.3217 1163.1318 1172.1001 1187.1463 1188.1175 1189.5467 1204.0056 1205.1661 1220.3017 1221.3611 1228.3063 1230.3043 1249.7902 1263.4311 1291.1153 1301.6351 1329.8310 1332.2794 1336.8524 1342.9286 1362.8921 1377.2907 1383.7260 1393.1775 1440.7823 1442.4988 1452.7612 1455.9410 1458.7753 1469.1077 1472.2048 1473.7518 1483.5704 1485.2586 1491.3885 1594.6113 1611.1330 1634.1854 1674.5294 2952.6249 2957.3431 2967.0952 2971.4886 2992.7964 3008.0333 3013.3461 3019.5626 3023.5743 3036.7823 3040.5580 3047.5557 3055.9302 3074.3982 3076.7891 3095.1262 3097.6917 3100.1575 3111.4579 3118.9940 3126.3042 3138.5358 3149.2688 3163.8599
redmass: 4.1266 5.8753 3.7877 4.7555 3.7448 5.8439 3.8590 4.5085 1.0753 3.8205 2.3991 2.2431 1.4786 3.1902 3.4376 4.1408 2.0416 1.9814 2.4568 2.4854 2.2267 2.8074 2.6831 2.7916 2.9390 3.2708 3.1779 5.0389 3.8305 3.9718 4.8548 5.1069 2.8249 3.5690 1.8138 2.3831 2.6353 2.4025 1.4417 2.4429 3.4766 2.6404 1.2488 2.3717 2.6152 2.1373 2.0323 1.9805 1.5435 1.8737 1.8799 1.9798 1.9226 1.3969 4.0716 2.7289 1.3761 1.4277 2.2300 2.2660 2.0180 1.2155 1.7377 1.7562 1.3769 1.7350 1.5117 1.5223 1.0547 1.7613 1.2196 1.1386 1.8116 2.5806 1.6146 1.6886 1.9297 1.3480 1.4824 2.1784 1.5679 1.7518 1.6058 1.2913 1.8189 1.6299 1.4551 1.2157 7.5826 1.2061 2.0813 1.1014 1.0810 1.1261 1.0617 1.0588 1.0789 1.0754 2.2080 1.0642 1.0565 6.1479 6.1765 9.5960 6.9342 1.0598 1.0647 1.0374 1.0377 1.0998 1.0584 1.0625 1.0703 1.0875 1.0796 1.0945 1.0985 1.0979 1.1073 1.0985 1.0960 1.0992 1.1063 1.0928 1.0859 1.0872 1.0921 1.0963 1.1016
irintensity: 0.1377 0.7589 0.1357 0.5392 0.1194 1.0904 0.6706 1.8408 0.4068 2.0229 3.1703 1.0570 0.4166 2.2231 2.6820 2.9503 1.8456 1.6218 2.9566 0.0931 0.7479 0.0794 0.8673 9.1037 1.5583 4.8468 1.2011 12.3992 14.0419 2.9995 1.0639 0.8921 1.3584 9.1362 68.5255 19.6391 15.5078 10.1689 16.2561 2.8167 4.2053 1.2612 0.3134 4.8698 16.8577 6.6245 0.2625 1.3195 0.3332 10.5192 8.7393 12.9385 3.3577 0.3979 3.2170 36.2065 0.3402 1.7863 7.2461 0.7403 17.8222 5.3129 52.0612 9.1472 16.0843 203.7623 4.5343 2.8917 1.3324 4.8018 5.9593 1.1572 11.4498 2.4083 99.4500 20.0772 22.7663 8.4086 1.2906 7.6333 71.6968 2.8258 5.2668 11.2724 0.3258 7.3686 1.5720 20.5211 1.6127 22.8493 9.5352 13.9505 11.1342 22.9491 1.6614 4.8180 12.3565 5.5456 18.5740 18.2771 10.5453 2.7015 17.1358 167.5737 1.3432 50.3140 30.5941 25.6654 52.0465 32.2536 18.0838 12.1732 17.5121 95.6495 35.1256 22.6316 6.2182 62.4962 33.6965 44.8458 13.0058 6.4059 48.2589 20.5009 6.5336 0.8759 24.5445 30.2867 18.1384
temp: 298.150 k
press: 1.00000 atm
elementType: 8 8 6 6 6 6 6 6 6 6 6 6 6 6 6 6 6 6 6 6 6 1 1 1 1 1 1 1 1 1 1 1 1 1 1 1 1 1 1 1 1 1 1 1 1
symmnumber: 1
zpe: 999757.9 jmol-1
zpe.correction: 0.380788 hartree
zpe.thermalcorrener: 0.401112 hartree
zpe.thermalcorrenthalpy: 0.402056 hartree
zpe.thermalcorrgfe: 0.327698 hartree
zpe.sumelectzpe: -887.262099 hartree
zpe.sumelectthermal: -887.241775 hartree
zpe.sumelectthermalent: -887.240831 hartree
zpe.sumelectthermalfe: -887.315189 hartree
dipole: 1.3961 -0.7495 1.0158
dipole: 1.8822
quadrupole: -124.8061 -120.7342 -124.9276
quadrupole: 5.0652 -1.5658 2.3674
quadrupole: -1.3168 2.7551 -1.4383 5.0652 -1.5658 2.3674
hfenergy: -887.6428868 hartree
pointgroup: C01 [X(C19H24O2)]
dipole: 0.540667 0.3319271 -0.3819272 debye
polarizability: 212.8337488|-9.593881|205.8857686|-23.7130955|-7.6670816|172.0729969 unknown
InChI: InChI=1S/C19H24O2/c1-19(2)16-9-8-15(17(19)13-16)10-11-21-18(20)12-14-6-4-3-5-7-14/h3-8,16-17H,9-13H2,1-2H3
charge 0 multiplicity 1
45 atoms
O  -0.037023 -2.002296 -0.351149
O  -1.769178 -2.678609 1.05452
C  2.353888 1.478833 0.586884
C  3.671266 1.698185 -0.279724
C  3.002393 0.058898 0.938232
C  4.409347 0.739907 0.724603
C  3.5556 0.986603 -1.654117
C  2.805182 -0.920049 -0.221635
C  0.987703 1.528009 -0.11791
C  2.304705 2.414618 1.816567
C  3.103212 -0.458036 -1.467839
C  2.348734 -2.338256 0.060696
C  0.949019 -2.447398 0.680938
C  -1.381817 -2.166755 -0.021525
C  -2.28441 -1.636871 -1.132711
C  -3.059555 -0.395105 -0.69054
C  -4.071717 -0.49214 0.298856
C  -2.772371 0.870675 -1.258533
C  -4.789015 0.655383 0.702899
C  -3.491417 2.019845 -0.855866
C  -4.503649 1.915106 0.125089
H  4.039454 2.734552 -0.382187
H  2.771426 -0.376171 1.926674
H  4.783338 1.26291 1.6190
H  5.203296 0.096057 0.311908
H  4.5333 1.018162 -2.179014
H  2.838803 1.527093 -2.308097
H  0.794404 2.548773 -0.502416
H  0.916775 0.818097 -0.957591
H  0.173058 1.284265 0.590975
H  2.068614 3.448984 1.500226
H  1.509719 2.091193 2.515467
H  3.254117 2.445971 2.378223
H  3.007571 -1.101522 -2.352472
H  3.046323 -2.81654 0.781877
H  2.375953 -2.942949 -0.864904
H  0.828438 -1.802639 1.570305
H  0.706053 -3.486051 0.969598
H  -2.99229 -2.448081 -1.385822
H  -1.670192 -1.418769 -2.02016
H  -4.283096 -1.464411 0.758004
H  -1.984752 0.958068 -2.017104
H  -5.569841 0.567528 1.466855
H  -3.260686 2.991808 -1.306354
H  -5.063083 2.804223 0.437171
