program: Gaussian 09
title: 000161682
version: EM64L-G09RevD.01
frameworkgroup: C1[X(C8H11BrN2)]
method: RPBEPBE
basis: SDD
operation: Freq
keyword: #p
keyword: freq=noraman
keyword: PBEPBE/SDD
title: #p freq=noraman PBEPBE/SDD
converged: YES YES NO NO
title: Mulliken charges:
elementType: Br N N C C C C C C C C H H H H H H H H H H H
charge: -0.027353 -0.289480 -0.582195 -0.583595 0.581765 -0.328169 -0.395014 -0.396405 -0.189574 -0.229054 -0.237952 0.222004 0.236411 0.208510 0.238316 0.242903 0.248372 0.249660 0.230987 0.235468 0.265423 0.298973
chargesum: 0.00000
title: Mulliken charges with hydrogens summed into heavy atoms:
elementType: Br N N C C C C C C C C
charge: -0.027353 -0.041109 -0.017799 -0.125180 0.581765 0.118658 -0.395014 -0.153501 0.060086 0.001932 -0.002484
polarizability: 1.40603011e+02 1.25333177e+01 1.36041008e+02 -1.08045012e+01 2.99129648e+00 6.75796785e+01
1716.lowfreq: -10.2056 -5.4374 -0.0005 -0.0003 -0.0002 6.7080 29.2923 70.8778 81.2688
frequency: 29.1052 70.8452 81.2521 105.8800 137.6035 209.1714 230.6694 258.8224 315.0538 353.9168 401.5269 414.2384 444.5875 470.0240 539.8835 585.2705 645.4060 712.6903 735.3337 760.1949 798.3547 819.4616 869.8607 950.3566 987.2574 996.5054 1009.4795 1030.4583 1043.1773 1065.3329 1128.9040 1151.8230 1171.4950 1178.7909 1213.4209 1234.4449 1255.4066 1285.2693 1288.7247 1356.6707 1369.1500 1421.3408 1458.2453 1464.9301 1474.4534 1491.3420 1569.1291 1600.6258 1647.6619 2902.4206 2994.0001 3049.5330 3069.8850 3125.8364 3141.0650 3157.7775 3173.4748 3329.2781 3413.5426 3595.1523
redmass: 5.5267 3.8579 2.2370 2.5541 4.5153 3.8582 4.0725 6.3571 5.2186 1.4523 2.7247 1.6170 2.3167 2.3609 3.4222 5.2041 6.6269 2.1537 2.0305 1.2699 1.1738 3.7057 1.3969 1.3848 1.3317 4.0945 2.4487 2.9904 2.5190 2.0205 1.5782 2.5825 1.1048 1.2100 2.1178 1.5580 1.2709 1.2542 1.4754 1.3436 7.0594 2.1528 2.3969 1.1606 1.0946 1.0848 5.9631 7.0443 1.0865 1.0710 1.0614 1.0915 1.0985 1.0871 1.0894 1.0948 1.0998 1.0743 1.0471 1.0968
irintensity: 1.8103 1.4875 6.9481 3.5417 0.6411 1.1782 4.3225 1.0138 3.7338 55.4980 3.3682 117.6172 81.1083 37.1855 9.4890 9.6705 19.7116 43.7458 28.7059 98.6635 2.7819 5.4763 1.3369 1.7379 0.0592 36.1977 25.5139 8.9145 14.3589 4.8650 1.9966 3.4688 0.8086 1.9143 0.1001 1.8362 0.9587 2.4597 3.1389 10.8347 2.8805 22.0724 44.0439 6.4004 6.6934 7.3506 12.2908 3.1765 5.8741 70.8769 25.7570 4.4737 29.0970 4.8350 8.9967 17.9681 15.5678 22.0391 20.7471 3.5190
temp: 298.150 k
press: 1.00000 atm
elementType: 35 7 7 6 6 6 6 6 6 6 6 1 1 1 1 1 1 1 1 1 1 1
symmnumber: 1
zpe: 465260.7 jmol-1
zpe.correction: 0.177208 hartree
zpe.thermalcorrener: 0.188748 hartree
zpe.thermalcorrenthalpy: 0.189692 hartree
zpe.thermalcorrgfe: 0.137712 hartree
zpe.sumelectzpe: -433.537723 hartree
zpe.sumelectthermal: -433.526184 hartree
zpe.sumelectthermalent: -433.525239 hartree
zpe.sumelectthermalfe: -433.577219 hartree
dipole: -0.4108 0.3614 -0.0947
dipole: 0.5553
quadrupole: -61.5977 -71.5637 -78.6396
quadrupole: 8.2561 -2.4624 1.4851
quadrupole: 9.0027 -0.9634 -8.0393 8.2561 -2.4624 1.4851
hfenergy: -433.7149311 hartree
pointgroup: C01 [X(C8H11Br1N2)]
dipole: 0.1465813 0.156003 0.0436194 debye
dipolederiv: -0.1779889 0.2158284 0.0208834 0.1941565 -0.628257 -0.0321836 0.0079184 -0.0264132 -0.0638736 -0.1506616 -0.0047722 0.2292876 -0.2283589 -0.1346216 0.2291104 0.107757 0.3121133 -0.2187977 -0.4000843 0.0994268 0.1786209 0.249947 -0.2555575 -0.2454867 0.110317 -0.3703746 -0.3308168 -0.2410979 0.0424243 -0.0324993 0.0069701 0.1414429 0.0338506 -0.1713937 -0.0284068 0.0806198 0.3380282 0.1539892 -0.0388195 -0.0027966 -0.354423 0.0111026 -0.1102174 -0.0249829 -0.0103889 0.513826 0.0446177 -0.1326591 -0.0448136 0.2588368 -0.1172488 0.093404 -0.0546021 0.201189 0.0858197 -0.4142433 -0.0650128 -0.388197 1.0568173 0.0474976 -0.0196371 0.0337098 -0.1167567 -0.100327 -0.069212 -0.0505038 0.1192974 0.074976 -0.0510681 -0.0393724 0.0088428 -0.1338008 -0.0929563 0.1163545 -0.0079349 0.1852524 -0.2302637 -0.056073 -0.01429 -0.0267933 -0.0804716 -0.0275211 -0.033592 -0.0306331 -0.052832 0.072439 -0.0080933 -0.0325144 -0.0116267 -0.131539 0.0134475 0.0320619 -0.0830831 -0.0525465 0.0003791 0.0015889 -0.0602995 -0.0294972 -0.1352482 0.0363664 0.0218831 0.0350628 0.0472494 -0.0409859 -0.1299745 0.0281233 -0.0630064 0.0195635 0.0550999 -0.0127916 0.0224934 -0.027103 -0.0489458 0.1243553 0.023584 0.0743209 -0.0076034 -0.083905 -0.0347405 0.0527648 -0.0625441 -0.0750641 0.1586946 0.1119384 0.0992508 -0.0917529 0.0408035 0.0223304 0.0154627 0.0301656 -0.0718516 -0.086837 0.0456654 -0.0630648 0.0132684 0.0373276 -0.0783546 0.056255 -0.068192 -0.0479992 0.0380667 0.0510529 0.0459519 0.1202549 0.0590341 -0.031011 -0.1037175 0.0250174 -0.0102598 -0.244378 -0.0870819 -0.1373766 0.1181056 0.0594 -0.0566332 0.037331 -0.0748456 -0.0091576 0.0409696 0.044176 0.0371019 0.1416502 0.048076 0.0825123 0.0272455 0.0960278 -0.0832145 -0.0035739 0.0310142 -0.0021507 0.1509449 -0.0892238 0.0298451 0.0840188 0.0253565 0.0630645 0.0011808 0.0871135 -0.0002328 0.135673 0.063061 -0.0215066 -0.1602155 0.0361808 0.0588635 0.1894105 -0.2023033 0.1163851 0.1500758 0.0134759 -0.1044167 -0.0543475 -0.0133917 0.263782 0.0990893 -0.0049543 0.1108513 0.1897043 unknown
polarizability: 143.1896038|-11.494877|133.8411563|-10.1192145|-2.030252|67.1929376 unknown
InChI: InChI=1S/C8H11BrN2/c9-8-4-2-1-3-7(8)5-6-11-10/h1-4,11H,5-6,10H2
charge 0 multiplicity 1
22 atoms
Br -0.404873 -2.742142 -0.147354
N  3.402853 0.037522 -0.227097
N  4.395223 0.204646 0.779214
C  1.026764 0.127757 -0.905951
C  -0.415432 0.201835 -0.442141
C  2.01905 0.15706 0.286638
C  -1.182469 -0.925236 -0.05195
C  -1.059971 1.466766 -0.346392
C  -2.512599 -0.824405 0.406368
C  -2.387431 1.598507 0.112036
C  -3.118228 0.449448 0.48971
H  1.194033 -0.797882 -1.490139
H  1.262993 0.981367 -1.565852
H  1.751319 -0.647295 1.012391
H  1.948915 1.119345 0.821827
H  -0.493921 2.357679 -0.643672
H  3.521764 -0.820344 -0.793647
H  -3.066635 -1.723159 0.692184
H  -2.850234 2.589425 0.170522
H  -4.150709 0.534964 0.844516
H  4.631573 -0.605824 1.364821
H  5.185313 0.775463 0.478567
