program: Gaussian 09
title: 000161681
version: EM64L-G09RevD.01
frameworkgroup: C1[X(C21H26N2O4S2)]
method: RPBEPBE
basis: SDD
operation: Freq
keyword: #p
keyword: freq=noraman
keyword: PBEPBE/SDD
title: #p freq=noraman PBEPBE/SDD
converged: YES YES NO NO
title: Mulliken charges:
elementType: S S O O O O N N C C C C C C C C C C C C C C C C C C C C C H H H H H H H H H H H H H H H H H H H H H H H H H H
charge: 0.203105 1.045956 -0.406546 -0.348181 -0.509217 -0.535545 -0.104302 -0.407410 -0.424790 -0.374699 0.267317 0.297082 -0.490425 0.522985 -0.325896 -0.330813 0.099738 -0.405170 0.398997 -0.403187 -0.311671 -0.493956 -0.671000 -0.669453 -0.338879 -0.310516 -0.245529 -0.221141 -0.731826 0.208771 0.226029 0.237803 0.218871 0.385844 0.206080 0.190752 0.206515 0.194185 0.257348 0.239529 0.231025 0.259420 0.209433 0.228042 0.209162 0.209273 0.226034 0.208849 0.289501 0.252817 0.237017 0.237567 0.278354 0.287543 0.289207
chargesum: 0.00000
title: Mulliken charges with hydrogens summed into heavy atoms:
elementType: S S O O O O N N C C C C C C C C C C C C C C C C C C C C C
charge: 0.203105 1.045956 -0.406546 -0.348181 -0.509217 -0.535545 -0.104302 -0.021566 0.010010 0.081975 0.267317 0.297082 -0.490425 0.522985 0.070937 0.069888 0.099738 -0.147822 0.398997 -0.163658 -0.311671 -0.003511 -0.024363 -0.025298 -0.049378 -0.057699 -0.008512 0.016426 0.123278
polarizability: 4.88120371e+02 7.93413978e+00 3.89536425e+02 -5.94670568e+00 1.29484549e+01 1.91991230e+02
1716.lowfreq: -4.5183 -0.0015 -0.0002 0.0013 2.4170 4.9629 9.8151 19.0653 20.6060
frequency: 8.6452 19.0550 20.5885 31.3995 35.7238 39.1942 44.9840 56.4334 72.9965 77.2822 85.0673 95.9618 119.0316 130.3465 138.4020 156.9959 176.9325 182.3494 184.1050 198.2612 206.7772 213.6526 217.8894 224.6812 259.4244 262.4600 282.4555 289.3448 301.0657 310.9022 335.6621 340.7292 355.9235 371.3206 374.0102 406.6594 422.6614 425.8452 431.9511 440.4624 463.7551 475.6039 484.1919 492.0275 513.6123 526.7511 558.4580 591.6952 604.3051 613.2645 652.4488 683.2820 717.4859 732.4995 743.0137 755.1004 762.4823 790.1932 794.8770 798.9477 804.0302 821.6914 826.1146 852.3474 855.0021 866.1443 880.7214 884.5378 909.0117 916.5306 957.6398 965.0300 974.9806 991.4905 993.8629 1007.0966 1009.5434 1030.8501 1036.6385 1055.3839 1059.5621 1064.1258 1075.6351 1082.6214 1084.4124 1088.3665 1119.1845 1122.2171 1147.8757 1170.3296 1171.0989 1173.7517 1192.5239 1208.4982 1238.3019 1247.3592 1254.6310 1276.1207 1281.9807 1291.4504 1298.8984 1313.5742 1318.2852 1331.5638 1341.2322 1358.0279 1361.2596 1366.9566 1377.8499 1385.1141 1388.3643 1392.0792 1393.1591 1412.0712 1414.8939 1418.6384 1425.2142 1460.0423 1462.2228 1464.3851 1470.3975 1475.2386 1481.7362 1485.6948 1486.4375 1488.2618 1491.1172 1497.4763 1535.3908 1569.5400 1586.4306 1602.4881 1614.7324 2857.9319 2863.0301 2876.5837 2951.9336 2975.4816 2983.3290 2983.9400 3003.6783 3020.8771 3035.9037 3036.9765 3045.5070 3053.4564 3074.9046 3076.5921 3091.3874 3092.2734 3131.9904 3133.2273 3133.9693 3145.8486 3160.9290 3174.1913 3180.1557 3187.0835 3192.7084
redmass: 3.4743 4.5696 5.9632 7.0051 5.7727 4.7071 7.1573 4.3554 3.9755 2.9892 2.2281 4.4563 5.1040 5.0846 3.3150 2.6177 1.1255 2.8225 2.3666 3.0752 5.4912 4.0880 3.5705 1.3379 2.7670 5.0741 2.8642 3.0347 2.8909 3.4932 7.2525 4.9840 6.6154 4.2701 5.2816 5.6550 3.8919 4.2867 7.9012 3.7362 3.8239 4.1824 4.9164 5.0789 4.5829 4.7846 6.5367 7.6491 5.0209 4.4357 5.9232 4.7221 7.1689 4.1857 3.3361 3.2844 1.7687 1.2237 1.1389 1.4750 1.8724 2.7822 3.5855 4.6984 1.3082 5.6046 5.5626 1.4280 3.0615 1.8924 1.7304 1.8121 1.3689 1.4530 2.2226 1.3413 2.1768 3.0413 1.9040 2.9145 3.3583 1.7409 1.9148 2.8327 2.2894 3.5789 1.9910 1.7468 2.0737 1.5620 1.4685 1.1460 1.1178 2.2457 1.4674 1.7406 1.9688 1.4912 1.3035 1.2650 1.2046 1.1338 1.9037 1.9219 1.3977 2.3064 1.6175 1.3748 4.7823 1.5027 1.2306 1.2505 6.7732 3.6510 1.0651 1.0515 2.4088 2.4335 1.0576 1.0575 1.0595 1.0855 1.0716 1.0756 1.1078 1.1320 1.1058 4.2085 3.4091 4.9594 2.8375 6.2469 7.2249 1.0720 1.0714 1.0708 1.0599 1.0601 1.0358 1.0360 1.0990 1.0878 1.0877 1.0245 1.0913 1.1042 1.0986 1.0981 1.1004 1.1004 1.0878 1.0864 1.0849 1.0906 1.0949 1.0989 1.0937 1.1079 1.1077
irintensity: 0.0590 0.0786 0.7962 2.6462 1.3956 0.7491 4.1451 0.3880 1.9274 0.7047 0.4922 0.6821 10.7704 0.6209 0.6134 1.3321 0.6042 0.8577 0.9973 0.5537 1.2088 2.5642 2.8174 0.3657 0.9085 6.7286 6.1609 8.2853 5.7390 4.3400 21.7137 33.2116 5.1427 26.9927 4.6097 3.3775 3.1382 3.4948 0.9770 5.2188 13.3079 16.0056 0.3605 6.5033 9.1979 17.4671 16.1725 60.1374 3.9912 12.7053 12.8159 3.5973 6.0220 12.2893 8.8034 8.0911 26.2530 29.1921 3.5700 56.5635 12.6017 78.2429 89.0770 33.4459 30.0723 70.7461 17.7241 0.2238 49.5778 1.2336 3.2196 6.8241 2.1320 65.8508 6.7095 0.8384 5.5979 25.3448 67.4081 2.7697 12.4448 26.8378 15.5097 76.9916 2.3364 4.3719 4.8770 7.0843 9.0779 13.8266 2.5558 7.8395 16.6968 47.5971 12.5675 34.2821 26.9694 32.9471 49.1466 54.1580 40.5841 4.0084 121.2120 42.0175 88.4001 18.2039 6.4123 5.4508 14.2066 19.5194 21.5023 24.2900 8.5337 76.9937 5.0991 6.8574 96.7235 6.8363 2.3380 13.0128 1.3657 49.7447 62.1107 4.0810 28.8793 67.4376 15.3063 148.3406 98.8738 50.6539 206.1761 20.8713 616.5295 35.5789 94.1171 149.0340 78.0293 20.9844 32.9273 31.7739 18.3724 24.7582 17.6050 0.4365 35.7471 23.6008 40.7558 91.1417 42.8283 38.9498 82.8429 1.0997 93.5768 8.5041 9.3675 25.3345 13.2422 0.1110 0.3734
temp: 298.150 k
press: 1.00000 atm
elementType: 16 16 8 8 8 8 7 7 6 6 6 6 6 6 6 6 6 6 6 6 6 6 6 6 6 6 6 6 6 1 1 1 1 1 1 1 1 1 1 1 1 1 1 1 1 1 1 1 1 1 1 1 1 1 1
symmnumber: 1
zpe: 1136589.9 jmol-1
zpe.correction: 0.432904 hartree
zpe.thermalcorrener: 0.463436 hartree
zpe.thermalcorrenthalpy: 0.464380 hartree
zpe.thermalcorrgfe: 0.366974 hartree
zpe.sumelectzpe: -2020.027548 hartree
zpe.sumelectthermal: -2019.997017 hartree
zpe.sumelectthermalent: -2019.996072 hartree
zpe.sumelectthermalfe: -2020.093478 hartree
dipole: 4.4751 3.1869 1.6970
dipole: 5.7500
quadrupole: -184.8797 -187.3548 -184.2614
quadrupole: -27.9213 -16.5588 2.5376
quadrupole: 0.6190 -1.8562 1.2372 -27.9213 -16.5588 2.5376
hfenergy: -2020.4604523 hartree
pointgroup: C01 [X(C21H26N2O4S2)]
dipole: 1.7323895 -1.3500436 -0.5421719 debye
polarizability: 486.7001507|-11.13865|391.024171|16.2380469|1.6693737|191.9237047 unknown
InChI: InChI=1S/C21H26N2O4S2/c1-4-23(5-2)13-12-22-17-11-10-15(14-27-29(3,25)26)21-19(17)20(24)16-8-6-7-9-18(16)28-21/h6-11,22H,4-5,12-14H2,1-3H3
charge 0 multiplicity 1
55 atoms
S  -2.99567 -0.500557 0.38862
S  -5.346857 2.685513 -0.707494
O  -3.454074 2.661425 -0.611045
O  1.218934 -2.170296 -0.05291
O  -5.91419 4.182902 -0.941675
O  -5.930324 1.777413 0.510102
N  6.013747 0.746451 -0.013286
N  2.291308 0.138327 0.093791
C  4.74279 -0.002971 -0.140515
C  3.52991 0.92382 0.091698
C  -0.14496 -0.201888 0.253311
C  1.038883 0.669605 0.252607
C  -1.424298 0.424139 0.417124
C  -1.574323 1.826148 0.600995
C  7.07887 0.261887 -0.93304
C  6.47218 0.862755 1.399601
C  0.036641 -1.656848 0.105662
C  0.869541 2.079653 0.423216
C  -1.108751 -2.609716 0.147985
C  -0.401858 2.626708 0.589741
C  -2.467221 -2.22641 0.275987
C  -2.911534 2.492237 0.776786
C  6.851899 0.692277 -2.394376
C  7.34599 2.106657 1.648861
C  -0.812562 -4.001253 0.05359
C  -3.50296 -3.194785 0.308339
C  -1.829096 -4.96743 0.085305
C  -3.183443 -4.561166 0.213779
C  -5.415923 1.717371 -2.338813
H  4.689498 -0.867446 0.567485
H  4.67186 -0.425465 -1.159147
H  3.517142 1.692872 -0.706205
H  3.650463 1.46144 1.055577
H  2.297982 -0.900439 -0.016691
H  8.037151 0.68893 -0.586471
H  7.190837 -0.850601 -0.877411
H  5.574171 0.929979 2.042208
H  7.020025 -0.058061 1.723621
H  1.745663 2.73149 0.42367
H  -0.511105 3.710279 0.71669
H  -2.798901 3.488676 1.239078
H  -3.630791 1.889684 1.367505
H  5.907632 0.288581 -2.803472
H  6.809184 1.793021 -2.464299
H  7.675152 0.32708 -3.036433
H  8.272809 2.089108 1.047006
H  6.788562 3.022048 1.384527
H  7.640781 2.16422 2.713344
H  0.241566 -4.276647 -0.04478
H  -4.545686 -2.87601 0.414454
H  -1.579479 -6.030882 0.012865
H  -3.984591 -5.307459 0.243086
H  -6.479327 1.636294 -2.603135
H  -4.94626 0.748046 -2.127871
H  -4.843086 2.311292 -3.062943
