program: Gaussian 09
title: 000161659
version: EM64L-G09RevD.01
frameworkgroup: C1[X(C9H5Cl2N3O2)]
method: RPBEPBE
basis: SDD
operation: Freq
keyword: #p
keyword: freq=noraman
keyword: PBEPBE/SDD
title: #p freq=noraman PBEPBE/SDD
converged: YES YES NO NO
title: Mulliken charges:
elementType: Cl Cl O O N N N C C C C C C C C C H H H H H
charge: -0.038254 -0.016318 -0.218281 -0.190624 -0.407862 -0.088603 -0.409709 0.389876 0.185111 -0.296361 -0.228351 -0.135787 -0.187268 0.193823 -0.213370 0.059943 0.337617 0.349734 0.269025 0.272850 0.372808
chargesum: 0.00000
title: Mulliken charges with hydrogens summed into heavy atoms:
elementType: Cl Cl O O N N N C C C C C C C C C
charge: -0.038254 -0.016318 -0.218281 -0.190624 -0.058128 -0.088603 -0.036901 0.389876 0.185111 -0.296361 0.109266 -0.135787 0.081757 0.193823 0.059480 0.059943
polarizability: 2.12976774e+02 -5.10407054e+00 1.83908882e+02 -1.83681594e-02 1.64955980e-01 5.32522726e+01
1716.lowfreq: -6.6886 -1.5704 -0.0023 -0.0018 0.0014 3.5418 10.6605 76.2901 87.9677
frequency: 10.4315 76.2886 87.9663 105.2922 125.5054 171.8724 195.0110 209.8685 231.9018 294.3344 297.8687 312.6395 388.2570 429.7145 447.5819 508.8095 517.1271 520.6868 561.8189 619.8852 649.6954 655.0797 681.6759 707.8457 733.0558 748.0744 754.3410 784.4449 818.2090 884.4178 928.0555 945.7550 967.2570 982.3261 1012.2624 1083.0293 1091.2850 1132.8680 1167.0218 1243.3922 1251.1469 1313.7121 1359.2845 1363.9739 1381.8790 1440.6445 1470.0932 1539.0887 1561.1654 1594.0171 1653.3828 1691.1530 3164.0298 3168.6887 3186.5924 3452.8177 3535.7777
redmass: 14.4139 5.1902 10.9645 15.2938 7.5791 9.0389 16.2306 7.1257 16.4545 10.4882 6.6530 20.9334 10.9672 5.8245 3.4816 8.7942 10.2923 4.8901 10.3290 6.8419 7.7043 3.4678 2.3322 2.1404 9.3510 2.9070 2.3957 2.8427 1.3438 8.1756 6.5485 1.3994 1.3569 4.8180 6.4649 5.7233 1.9494 1.5315 4.1093 2.0689 1.4934 5.8282 4.5223 1.5993 5.0745 2.3473 2.8468 5.8030 6.9742 7.9624 8.3960 6.1399 1.0923 1.0892 1.0983 1.0793 1.0777
irintensity: 0.7494 0.1966 0.7427 1.2329 0.8802 10.0919 2.0394 0.9724 0.2595 1.8307 0.2125 0.9763 25.7276 2.5816 5.2898 2.6231 32.1944 20.7516 2.4205 11.5959 2.5973 7.7834 29.5916 8.6508 8.8321 0.2432 24.2011 183.9779 40.1700 25.7481 16.4496 6.3273 9.7547 7.2370 88.2030 55.9345 23.9433 2.3700 9.9872 6.8416 54.7236 310.0072 35.3021 24.4210 42.0742 174.6424 58.3485 403.0176 240.1543 0.9383 410.2823 647.0131 20.5736 0.3560 0.3987 220.0577 69.3928
temp: 298.150 k
press: 1.00000 atm
elementType: 17 17 8 8 7 7 7 6 6 6 6 6 6 6 6 6 1 1 1 1 1
symmnumber: 1
zpe: 348175.5 jmol-1
zpe.correction: 0.132613 hartree
zpe.thermalcorrener: 0.146036 hartree
zpe.thermalcorrenthalpy: 0.146980 hartree
zpe.thermalcorrgfe: 0.089950 hartree
zpe.sumelectzpe: -1579.698443 hartree
zpe.sumelectthermal: -1579.685021 hartree
zpe.sumelectthermalent: -1579.684077 hartree
zpe.sumelectthermalfe: -1579.741106 hartree
dipole: 3.6292 4.1267 0.0252
dipole: 5.4955
quadrupole: -106.6756 -119.2198 -105.7360
quadrupole: 7.7475 0.0441 -0.1631
quadrupole: 3.8682 -8.6760 4.8078 7.7475 0.0441 -0.1631
hfenergy: -1579.8310563 hartree
pointgroup: C01 [X(C9H5Cl2N3O2)]
dipole: 1.683516 1.1067538 -0.7846084 debye
dipolederiv: -0.3088317 0.159754 -0.1626527 0.0925779 -0.3685142 0.2986624 -0.1024358 0.305614 -0.3060783 -0.3490048 0.2136145 -0.2114419 0.2978826 -0.322682 0.268498 -0.2838735 0.2609298 -0.2918379 -0.9484481 0.2854206 -0.2891583 0.3494358 -0.6707283 0.2812512 -0.3424612 0.2758335 -0.6316382 -0.7795289 -0.3088763 0.2238232 -0.2786239 -0.8110299 0.3555623 0.1981818 0.353503 -0.6397745 -1.5253278 0.2991704 -0.3595697 -0.049268 -0.5543455 0.2531244 -0.0672919 0.2806295 -0.4898461 -1.4652914 -0.5220639 0.3335751 -0.5071875 -0.6896141 0.3269812 0.320495 0.327344 -0.4945748 -0.6764573 0.0741487 -0.0906768 0.1616686 -0.859802 0.4455876 -0.1648854 0.4384525 -0.7279537 -0.5842201 0.0275714 -0.0785677 -0.0631122 -0.0677461 0.0730988 -0.0007594 0.0817338 -0.0465478 1.5457068 0.0593468 0.0684555 0.207198 0.7919296 -0.5028355 -0.0548537 -0.5169788 0.5960977 0.4118308 -0.334116 0.335085 -0.0082508 0.4626506 -0.475704 0.0557193 -0.5049247 0.3552685 -0.2002234 0.1332901 -0.12923 -0.028915 -0.1641385 0.1025245 0.0074705 0.1172165 -0.1412816 0.4541688 -0.4628805 0.4463482 -0.5434047 0.429674 -0.4846083 0.5156707 -0.4766448 0.3793148 -0.2266909 0.0961005 -0.0965402 0.1592418 -0.1009394 0.0332405 -0.1512105 0.0270473 -0.1172325 1.8541168 -0.2829052 0.3679702 -0.2354718 0.9942636 -0.5727862 0.3269332 -0.5775703 0.846917 -0.0224765 0.0861425 -0.0689352 0.0423674 -0.10244 0.0244596 -0.0309018 0.028304 -0.1045576 1.8755384 0.4041766 -0.2068459 0.2662657 1.1748039 -0.6983609 -0.0885474 -0.686862 0.8880452 0.2437983 -0.0035369 0.0111561 0.0030263 0.117218 0.0361592 0.0071071 0.0347545 0.1289578 0.4125694 0.0865763 -0.066979 0.1438577 0.3037903 0.0245817 -0.1175834 0.0209799 0.2928655 0.0722755 -0.0208161 0.0090996 -0.036934 0.0686119 0.0820318 0.0229373 0.0836954 0.097684 -0.0096993 -0.0056725 -0.0112931 -0.0014023 0.1265359 0.0348195 -0.0146594 0.0342371 0.1361891 0.2261954 0.0155551 -0.0236222 0.0290484 0.2425021 0.093712 -0.0350516 0.0927056 0.2699833 unknown
polarizability: 209.6375317|-0.5202674|129.9656412|14.391417|-65.5663173|110.5347558 unknown
InChI: InChI=1S/C9H5Cl2N3O2/c10-4-1-2-6(11)5(3-4)7-12-8(15)14-9(16)13-7/h1-3,12,14H
charge 0 multiplicity 1
21 atoms
Cl 0.831675 2.290926 -2.017148
Cl 3.940656 -1.835043 1.820749
O  -3.652456 1.257523 -1.482335
O  -2.93509 -2.254714 1.532851
N  -1.476096 0.689845 -0.818942
N  -1.061077 -1.089836 0.710485
N  -3.3000 -0.509135 0.031139
C  0.866931 0.105164 -0.126538
C  -0.61783 -0.112031 -0.073352
C  1.601614 1.060504 -0.883607
C  1.628969 -0.774252 0.700664
C  3.024024 -0.68992 0.7542
C  3.007718 1.142147 -0.825658
C  -2.887144 0.530701 -0.806426
C  3.737095 0.263051 -0.001596
C  -2.444571 -1.35383 0.815305
H  1.064396 -1.508898 1.282286
H  -1.116502 1.439859 -1.420612
H  3.531005 1.892193 -1.424437
H  4.827659 0.322816 0.046586
H  -4.307476 -0.683571 0.091785
