program: Gaussian 09
title: 000161655
version: EM64L-G09RevD.01
frameworkgroup: C1[X(C16H12O4)]
method: RPBEPBE
basis: SDD
operation: Freq
keyword: #pfreq=noraman
keyword: PBEPBE/SDD
title: #p freq=noraman PBEPBE/SDD
converged: YES YES NO NO
title: Mulliken charges:
elementType: O O O O C C C C C C C C C C C C C C C C H H H H H H H H H H H H
charge: -0.265348 -0.234922 -0.412163 -0.224041 0.516210 -0.336754 0.167130 0.181266 -0.501381 -0.424093 0.188504 0.054750 -0.355851 0.174015 -0.703281 0.184985 -0.355000 -0.349340 -0.251488 -0.209781 0.249489 0.296819 0.246936 0.263912 0.228284 0.247535 0.226165 0.281552 0.263872 0.237595 0.237152 0.377270
chargesum: 0.00000
title: Mulliken charges with hydrogens summed into heavy atoms:
elementType: O O O O C C C C C C C C C C C C C C C C
charge: -0.265348 -0.234922 -0.034892 -0.224041 0.516210 -0.087265 0.167130 0.181266 -0.204562 -0.177157 0.188504 0.054750 -0.091939 0.174015 -0.001297 0.184985 -0.073447 -0.085468 -0.013893 0.027371
polarizability: 2.91223645e+02 7.88045654e+00 1.89627105e+02 1.04094493e+01 -2.59928144e+00 9.64828728e+01
1716.lowfreq: -11.5907 -5.3182 -0.0005 -0.0002 0.0002 2.0383 6.4570 34.6813 41.5593
frequency: -6.0035 34.6739 41.5579 80.6429 111.3508 121.8874 149.0742 175.6295 201.1560 231.5114 244.5642 265.9105 292.9770 342.1038 354.4291 375.2748 410.2403 432.6011 454.6368 455.9604 510.7130 524.4740 530.5020 577.3299 595.9505 612.4869 628.2470 635.8346 682.0166 687.2333 710.7315 730.6873 771.2200 774.5896 803.8314 807.9010 839.6631 844.5797 859.6553 884.3696 947.8608 957.0356 971.0822 974.8540 1001.6562 1011.7828 1025.7428 1033.0486 1068.4061 1093.9800 1097.9565 1117.3216 1145.2544 1163.9786 1192.4970 1206.7216 1216.4881 1229.8908 1238.4850 1264.4187 1289.1780 1322.3484 1336.6758 1393.9550 1397.2196 1400.8172 1429.9932 1447.5365 1457.8008 1467.1666 1475.1063 1479.3095 1557.9570 1568.7008 1597.8662 1613.1755 1632.3216 1665.0977 2998.3044 3040.7904 3094.4304 3109.9020 3138.9363 3140.4263 3148.4291 3152.5312 3166.2265 3171.9122 3176.8556 3506.1507
redmass: 5.5516 6.9816 9.3167 7.6302 4.3028 4.1794 6.1490 4.7804 1.0897 4.2156 3.8100 5.7022 6.7152 5.4855 6.3332 5.9253 3.5147 6.1770 4.9375 3.3155 10.6033 3.7964 3.7989 3.7384 2.9393 4.7344 3.2340 2.6107 3.9528 5.2488 5.2015 4.0171 1.4919 3.7801 3.0377 2.9550 2.4027 2.3319 7.0664 1.4851 1.6609 2.7943 1.3629 1.3755 1.3345 2.4305 2.0514 2.1798 1.5889 2.3649 2.6352 2.1249 1.5908 1.1630 1.9134 2.5628 2.4150 1.9059 2.0237 1.3972 1.7500 1.9701 1.8796 1.2118 8.7423 7.7157 3.3274 2.7707 2.6166 1.1904 2.1850 1.0687 9.4322 7.0386 8.4645 6.7423 7.3634 8.3464 1.0356 1.0847 1.1002 1.1003 1.0896 1.0861 1.0917 1.0901 1.0954 1.0959 1.1001 1.0639
irintensity: 0.0765 1.9365 1.8766 1.3871 0.4811 0.6838 0.1137 0.8461 0.2328 1.2122 2.6748 1.3210 5.7386 1.2967 8.1100 2.0635 0.9912 1.0595 13.7504 1.6077 0.5762 6.6571 3.3875 36.8883 49.3737 33.4784 19.9669 87.2600 17.2357 2.6781 7.6460 2.6442 92.6229 25.5369 3.7936 5.5260 23.6315 20.2336 13.5783 0.8079 5.0847 2.1892 1.4991 5.7733 0.3158 22.8542 47.5683 230.1693 19.8086 22.3216 38.7255 36.0117 23.8343 2.0779 4.6683 19.5289 67.0759 1.7769 31.6383 27.6203 50.1150 125.1189 58.1636 23.5160 7.2678 7.2759 6.2539 237.4907 1.9953 6.1013 88.8780 11.9143 121.6428 13.1120 79.9297 105.0275 1.6515 193.6107 24.3750 7.9486 35.8492 15.9452 9.0281 4.0374 4.2772 3.9236 11.1918 4.6585 19.1820 23.9881
temp: 298.150 k
press: 1.00000 atm
elementType: 8 8 8 8 6 6 6 6 6 6 6 6 6 6 6 6 6 6 6 6 1 1 1 1 1 1 1 1 1 1 1 1
symmnumber: 1
zpe: 628779.8 jmol-1
zpe.correction: 0.239490 hartree
zpe.thermalcorrener: 0.255162 hartree
zpe.thermalcorrenthalpy: 0.256106 hartree
zpe.thermalcorrgfe: 0.196011 hartree
zpe.sumelectzpe: -916.434231 hartree
zpe.sumelectthermal: -916.418559 hartree
zpe.sumelectthermalent: -916.417615 hartree
zpe.sumelectthermalfe: -916.477710 hartree
dipole: -0.7364 4.1561 0.0482
dipole: 4.2211
quadrupole: -88.6038 -120.5934 -112.7658
quadrupole: 5.4627 1.7057 -0.4935
quadrupole: 18.7172 -13.2724 -5.4448 5.4627 1.7057 -0.4935
hfenergy: -916.6737206 hartree
pointgroup: C01 [X(C16H12O4)]
dipole: -0.2743502 -1.6159108 0.2673586 debye
polarizability: 291.0810867|-9.0433433|185.8343238|-11.3767554|-18.2234268|100.4182126 unknown
InChI: InChI=1S/C16H12O4/c1-9(16(18)19)10-6-7-14-12(8-10)15(17)11-4-2-3-5-13(11)20-14/h2-9,18H,1H3
charge 0 multiplicity 1
32 atoms
O  -1.714287 -1.640275 0.295804
O  -0.81625 2.363413 -0.646739
O  4.83312 -0.153264 1.576236
O  4.253536 1.880489 0.614844
C  2.3254 -0.572223 -0.3703
C  3.805802 -0.237137 -0.61233
C  -0.039805 0.104499 -0.247928
C  -0.387226 -1.237377 0.06801
C  1.327845 0.417344 -0.459388
C  1.941263 -1.905618 -0.047394
C  -2.472742 0.683268 -0.103441
C  -1.086737 1.154317 -0.356303
C  0.595104 -2.244779 0.170825
C  -2.736945 -0.678057 0.20964
C  4.048013 0.477075 -1.963151
C  4.304938 0.634864 0.542606
C  -3.571476 1.582462 -0.169584
C  -4.047209 -1.14478 0.451994
C  -4.880634 1.13521 0.068965
C  -5.115954 -0.232899 0.380538
H  4.3817 -1.178023 -0.575164
H  1.57088 1.461284 -0.686911
H  2.710981 -2.681146 0.036442
H  0.290729 -3.265706 0.417593
H  3.647451 -0.13248 -2.791121
H  3.556581 1.463897 -1.980472
H  5.127459 0.636688 -2.133567
H  -3.351197 2.627268 -0.412354
H  -4.202657 -2.201068 0.689307
H  -5.720612 1.834992 0.016138
H  -6.136675 -0.5835 0.567095
H  5.103305 0.434662 2.33371
