program: Gaussian 09
title: 000161650
version: EM64L-G09RevD.01
frameworkgroup: C1[X(C9H17N3O7)]
method: RPBEPBE
basis: SDD
operation: Freq
keyword: #p
keyword: freq=noraman
keyword: PBEPBE/SDD
title: #p freq=noraman PBEPBE/SDD
converged: YES YES NO NO
title: Mulliken charges:
elementType: O O O O O O O N N N C C C C C C C C C H H H H H H H H H H H H H H H H H
charge: -0.277463 -0.484334 -0.462078 -0.303092 -0.438857 -0.327845 -0.227812 -0.405086 -0.165369 0.046860 -0.176873 -0.135124 -0.092732 -0.029165 -0.090305 -0.378399 0.377400 -0.493195 -0.623257 0.291313 0.242666 0.217952 0.259243 0.243131 0.193038 0.254672 0.386803 0.385120 0.371617 0.211223 0.243327 0.240915 0.347209 0.279030 0.259555 0.259913
chargesum: 0.00000
title: Mulliken charges with hydrogens summed into heavy atoms:
elementType: O O O O O O O N N N C C C C C C C C C
charge: -0.277463 -0.099214 -0.090461 -0.303092 -0.091648 -0.327845 -0.227812 -0.018283 -0.165369 0.046860 0.114440 0.107543 0.125220 0.230078 0.152825 0.069310 0.377400 0.202270 0.175241
polarizability: 1.87413135e+02 8.72104936e+00 1.55771811e+02 -1.41997226e+00 -6.36469411e+00 9.99285258e+01
1716.lowfreq: -14.0815 -5.4859 -0.0009 -0.0008 -0.0006 5.1660 22.7136 34.7190 64.5140
frequency: 22.1435 34.6661 64.5104 66.9688 75.0403 90.7699 101.0945 115.1095 126.4888 134.9192 165.2834 176.5974 185.7335 201.6882 221.7634 248.9984 262.1100 300.3705 301.5163 318.7418 343.8078 351.3079 383.0182 389.6658 413.5406 437.8663 459.3209 474.1254 485.9359 527.8498 550.8200 580.7099 614.3725 630.9718 709.6264 716.7926 742.5950 766.6164 788.8810 828.1406 840.8067 919.4512 958.1680 976.0847 991.1404 997.0940 1003.5195 1011.7824 1045.9693 1060.4072 1068.9310 1086.1470 1113.8402 1116.3111 1117.0227 1121.9618 1146.0054 1156.7762 1186.5769 1199.1123 1213.9543 1242.7485 1261.5170 1271.6118 1287.6362 1299.0318 1314.3817 1318.5669 1326.8794 1336.6150 1342.6669 1359.8302 1371.0094 1378.7635 1403.0001 1412.6201 1422.2119 1431.8100 1457.3581 1461.3566 1461.8118 1468.6718 1477.5773 1492.6812 1623.2884 2956.6252 2965.2417 2969.4974 2981.9349 2990.3093 3008.1558 3017.0349 3027.9209 3063.9836 3094.0638 3114.5045 3128.1247 3151.5291 3280.0919 3459.8134 3534.6284 3545.4113
redmass: 6.2615 7.4917 4.3540 4.6419 4.4772 6.5506 4.4059 3.8324 1.1016 1.5594 2.6445 4.1567 5.5769 3.0962 5.8822 5.5296 4.4753 4.4372 4.3902 4.7691 4.1565 4.9573 6.0785 6.0716 3.7487 1.2951 2.9852 1.5844 4.6779 3.8853 3.5639 2.5933 3.1489 1.6097 7.0836 5.3945 1.2444 4.7052 3.0043 5.4370 3.3502 3.2036 4.5870 4.3179 5.3440 4.9484 3.8663 4.7114 4.3472 2.7753 3.8146 3.2796 2.4268 1.9973 1.3573 1.5142 1.3586 2.8176 1.3417 2.0261 1.3359 1.1985 1.4432 1.4393 1.2268 1.4927 1.2928 1.5744 1.1555 1.1849 1.2463 1.2882 7.3303 1.3049 1.8336 1.2098 1.4305 1.1539 1.0575 1.0821 1.0448 1.1573 1.0605 1.9303 9.1088 1.0816 1.0344 1.0699 1.0846 1.0856 1.0336 1.0849 1.0847 1.1011 1.1011 1.0944 1.1017 1.1012 1.0698 1.0773 1.0653 1.0654
irintensity: 0.4464 2.5399 4.0538 0.7067 2.3372 0.1782 6.2251 3.2870 0.1505 3.3387 1.8327 9.0760 0.4268 16.1445 1.2959 8.8716 2.3612 9.5637 1.5079 12.2716 34.7296 14.6609 2.9454 5.9793 33.7229 141.8263 78.6799 131.6026 32.2349 6.4549 48.6845 42.7072 9.3195 45.3813 12.4316 24.6099 86.7422 37.7112 39.8530 14.8856 45.6091 366.6131 66.3439 48.1657 33.9830 60.9956 9.8735 28.9872 78.7553 20.7834 190.5414 26.8741 46.0428 14.6842 2.6260 26.4086 5.1800 54.5412 18.7716 5.9942 17.7160 10.3656 20.4766 11.0102 6.6997 19.0137 21.6574 66.9331 31.7604 28.8591 7.7350 4.3544 178.5140 23.7805 19.2408 50.7403 60.1557 10.5622 6.3609 6.8792 22.4791 87.0480 14.3382 472.9438 180.4672 13.8804 54.8124 48.8155 37.5252 27.8155 12.8588 19.6794 39.3306 33.2913 11.0193 8.9093 14.4438 0.1945 460.6771 95.1195 23.5128 5.3519
temp: 298.150 k
press: 1.00000 atm
elementType: 8 8 8 8 8 8 8 7 7 7 6 6 6 6 6 6 6 6 6 1 1 1 1 1 1 1 1 1 1 1 1 1 1 1 1 1
symmnumber: 1
zpe: 737223.0 jmol-1
zpe.correction: 0.280793 hartree
zpe.thermalcorrener: 0.301341 hartree
zpe.thermalcorrenthalpy: 0.302285 hartree
zpe.thermalcorrgfe: 0.230779 hartree
zpe.sumelectzpe: -1042.382982 hartree
zpe.sumelectthermal: -1042.362434 hartree
zpe.sumelectthermalent: -1042.361490 hartree
zpe.sumelectthermalfe: -1042.432996 hartree
dipole: 2.8910 1.5771 2.0025
dipole: 3.8542
quadrupole: -129.6143 -114.7336 -111.4592
quadrupole: -8.9920 -2.8482 2.8695
quadrupole: -11.0119 3.8688 7.1432 -8.9920 -2.8482 2.8695
hfenergy: -1042.663775 hartree
pointgroup: C01 [X(C9H17N3O7)]
dipole: -1.1053362 -0.9159852 0.4883919 debye
polarizability: 187.2390882|9.0020563|141.7440914|2.4905058|25.1132315|114.1302924 unknown
InChI: InChI=1S/C9H17N3O7/c1-12(11-17)9(16)10-5-7(15)6(14)4(3-13)19-8(5)18-2/h4-8,10,13-15H,3H2,1-2H3
charge 0 multiplicity 1
36 atoms
O  2.392626 -1.095961 0.512171
O  0.137827 2.399607 0.972397
O  2.749237 2.564573 -0.06741
O  0.657637 -1.53468 -1.122178
O  5.037835 -1.105881 -0.4319
O  -2.316818 1.284312 1.524404
O  -4.733389 -1.584848 -1.122265
N  -1.259482 -0.361737 0.243149
N  -3.621218 -0.151913 0.200926
N  -3.584818 -1.231523 -0.694747
C  0.110704 -0.101991 0.732319
C  0.693283 1.25443 0.24789
C  2.209729 1.334121 0.506752
C  2.934129 0.147186 -0.132229
C  0.98047 -1.310693 0.283774
C  4.438397 0.107127 0.133528
C  -2.349967 0.30795 0.705926
C  1.304128 -2.729044 -1.694659
C  -4.883744 0.499444 0.590143
H  0.102793 -0.081906 1.840016
H  0.50691 1.357267 -0.842007
H  2.367497 1.314237 1.607978
H  2.733739 0.10125 -1.219876
H  0.747547 -2.216725 0.879663
H  4.626638 0.176345 1.225801
H  4.92311 0.956531 -0.369961
H  -1.359861 -1.039402 -0.523363
H  -0.798103 2.200444 1.279976
H  2.156973 3.301421 0.23829
H  1.044197 -3.634373 -1.110187
H  2.401584 -2.605086 -1.719712
H  0.91066 -2.817335 -2.717974
H  4.56661 -1.87764 -0.023544
H  -4.636765 1.309278 1.290178
H  -5.552876 -0.236633 1.067337
H  -5.392217 0.898247 -0.304406
