program: Gaussian 09
title: 000161625
version: EM64L-G09RevD.01
frameworkgroup: C1[X(C9H9NO4)]
method: RPBEPBE
basis: SDD
operation: Freq
keyword: #pfreq=noraman
keyword: PBEPBE/SDD
title: #p freq=noraman PBEPBE/SDD
converged: YES YES NO NO
title: Mulliken charges:
elementType: O O O O N C C C C C C C C C H H H H H H H H H
charge: -0.244054 -0.294267 -0.448099 -0.216937 -0.413871 0.353903 -0.390315 -0.241437 0.271382 -0.362589 -0.386632 -0.252257 -0.161948 0.180300 0.280225 0.281703 0.348654 0.278294 0.239796 0.264264 0.257454 0.262983 0.393448
chargesum: 0.00000
title: Mulliken charges with hydrogens summed into heavy atoms:
elementType: O O O O N C C C C C C C C C
charge: -0.244054 -0.294267 -0.054651 -0.216937 -0.065218 0.353903 0.171614 0.036857 0.271382 -0.122793 -0.122369 0.005197 0.101035 0.180300
polarizability: 2.41168245e+02 7.85972279e+00 1.15651712e+02 4.40544607e-01 -2.85931282e-01 5.22773888e+01
1716.lowfreq: -0.0006 -0.0005 0.0005 0.5620 3.2678 5.9722 23.5835 42.7119 49.1512
frequency: 22.3605 42.6960 49.1291 61.7421 88.5665 131.5313 137.0051 206.8941 236.7351 266.9859 291.3755 334.5848 449.9587 488.2562 539.4537 548.6756 574.7522 586.4059 635.6741 650.3825 663.6999 706.8602 737.0047 776.3182 817.5218 826.9612 868.8978 877.0560 878.1416 887.3447 974.4859 977.1196 989.1561 1018.4976 1052.7724 1078.8368 1108.7162 1134.5076 1182.0146 1207.0966 1207.9478 1254.0949 1273.6833 1293.1251 1308.0682 1334.4843 1369.5991 1455.4213 1463.8585 1480.7704 1550.8210 1575.0004 1663.8664 1683.9013 2985.0245 3019.5916 3123.4636 3131.9318 3221.0787 3235.7760 3266.5339 3530.8399 3558.9564
redmass: 4.8436 7.5972 6.9029 4.3880 4.8556 6.0291 3.6537 7.6052 2.7056 9.4064 7.1584 3.3002 5.6870 1.8307 4.3433 4.7725 1.1901 2.8478 3.6869 1.4503 6.8030 5.5900 1.2673 4.8571 1.3495 4.3654 6.6145 1.7662 4.4049 1.4879 4.0656 2.2119 1.1434 1.5926 2.5769 2.2013 3.1606 1.5958 1.5510 1.0918 1.7074 2.2417 2.0931 1.5376 2.0158 1.7601 2.5619 1.2383 2.2459 3.0549 5.8549 7.4169 6.5484 9.1804 1.0602 1.0986 1.0936 1.0884 1.0924 1.0979 1.1087 1.0644 1.0784
irintensity: 0.7660 1.9032 0.2989 9.3773 0.2447 3.6312 0.3347 2.2015 3.6094 8.8051 0.1719 9.5753 10.1796 53.1027 51.2621 20.6171 38.3174 16.6360 0.3454 191.8910 16.1706 2.7436 86.5543 3.9341 38.5958 18.0081 9.5399 12.2602 15.2539 4.6439 29.6817 5.9502 60.6339 26.7023 26.5484 218.9921 24.4231 4.4939 8.6234 2.7702 77.9574 32.4907 17.3765 10.6558 51.2788 23.8693 11.2470 28.1419 199.4707 313.7850 88.6425 196.1831 117.8362 286.2282 31.3782 5.1676 1.6438 5.0450 4.4987 0.5870 0.0668 31.3163 83.8836
temp: 298.150 k
press: 1.00000 atm
elementType: 8 8 8 8 7 6 6 6 6 6 6 6 6 6 1 1 1 1 1 1 1 1 1
symmnumber: 1
zpe: 443180.6 jmol-1
zpe.correction: 0.168799 hartree
zpe.thermalcorrener: 0.182156 hartree
zpe.thermalcorrenthalpy: 0.183100 hartree
zpe.thermalcorrgfe: 0.125998 hartree
zpe.sumelectzpe: -702.965088 hartree
zpe.sumelectthermal: -702.951731 hartree
zpe.sumelectthermalent: -702.950787 hartree
zpe.sumelectthermalfe: -703.007889 hartree
dipole: -2.7164 -3.9772 0.0123
dipole: 4.8164
quadrupole: -70.8072 -77.1866 -83.4421
quadrupole: -10.3433 0.1914 -0.0194
quadrupole: 6.3381 -0.0413 -6.2968 -10.3433 0.1914 -0.0194
hfenergy: -703.1338869 hartree
pointgroup: C01 [X(C9H9N1O4)]
dipole: 1.1312003 -1.4681648 -0.3943661 debye
dipolederiv: -0.3425646 -0.2111504 -0.0467515 -0.2047844 -0.4338566 -0.0700439 -0.0444778 -0.0701875 -0.1453032 -0.8687093 0.0988599 0.0404067 0.1579431 -0.9300495 -0.1406453 0.0567322 -0.139901 -0.4100164 -0.50517 0.2273805 0.0542989 0.2568699 -1.0859256 -0.1650889 0.0629348 -0.1624924 -0.4692912 -1.2648883 0.1391003 0.0721246 -0.1214534 -0.560243 -0.0503559 0.0138869 -0.061711 -0.3381927 -1.4250441 -0.3158054 -0.0467979 -0.5325728 -0.5893893 -0.0145018 -0.0973193 -0.0230376 -0.4601928 -0.3710227 0.1619172 0.0529197 0.0944424 0.2635052 0.0537763 0.0351087 0.0515217 0.0505446 0.5064434 -0.138788 -0.0341315 -0.4313828 -0.0862821 -0.0735139 -0.1059671 -0.0848426 0.2799949 0.888048 -0.0790959 -0.0485231 0.0049323 0.0615798 0.0321896 -0.0275185 0.0350269 -0.0601226 2.2581839 0.168972 -0.022268 0.0171833 1.1267406 0.2161496 -0.058651 0.2136676 0.29365 -1.1780835 0.1320123 0.0624571 -0.0639727 0.0136481 0.0627962 0.0114765 0.0561158 -0.2149583 0.2374763 -0.1133521 -0.0412717 -0.1267991 0.0266135 0.0588522 -0.0442465 0.0584964 -0.1781829 0.0277781 -0.0160598 -0.0108091 0.3273154 -0.1858212 -0.0045781 0.0749333 0.0060427 -0.2089846 -0.1742155 0.1877408 0.0494506 0.1562639 0.1608905 0.0653579 0.0405447 0.0646448 -0.1044763 1.6431902 -0.1572412 -0.0985328 0.0917328 1.3943358 0.2714057 -0.0453662 0.280569 0.2816793 -0.0662738 -0.0156804 -0.0221369 0.0989374 0.0611198 0.0673652 -0.0432222 0.0671558 0.0384264 -0.0483244 -0.0279916 0.0134497 0.0656177 0.1117589 -0.0371948 0.0836269 -0.0277817 -0.0131504 0.2616586 0.0504552 0.0139788 0.1934773 0.2075355 -0.039587 0.0478718 -0.0349483 0.3318418 0.122025 -0.0010578 0.0008472 0.002359 0.0178294 -0.0366322 0.0020697 -0.0364991 0.1553174 0.0376333 -0.0020013 0.0038841 0.0377588 -0.056647 -0.0609148 0.0141798 -0.0596285 0.1682422 0.1373661 0.008318 0.0038921 0.0026039 -0.0034849 -0.0512239 0.0024433 -0.0513933 0.1882438 -0.0542301 -0.0026434 0.0068469 -0.0052405 0.135764 -0.0165201 0.0062158 -0.0165771 0.1981615 0.0869182 0.0102725 0.0064176 0.0237224 0.0300516 -0.0479865 0.0097313 -0.0476107 0.2073089 0.0918052 -0.1041614 -0.0097517 -0.0449541 0.3203265 -0.0191054 0.0050129 -0.0166299 0.4094605 unknown
polarizability: 241.4141403|-1.2200614|111.6647697|-6.4237628|14.510151|56.0184365 unknown
InChI: InChI=1S/C9H9NO4/c11-8(10-6-9(12)13)4-3-7-2-1-5-14-7/h1-5,10,12H,6H2
charge 0 multiplicity 1
23 atoms
O  3.078104 -1.041165 -0.287925
O  -1.107093 1.940508 0.579337
O  -3.934299 -1.922738 -0.233292
O  -5.697305 -0.463951 0.185218
N  -2.040007 -0.129279 0.099115
C  2.868896 0.321676 0.058878
C  -3.393652 0.38741 0.273618
C  1.522958 0.804173 0.218965
C  -0.947795 0.712123 0.271224
C  0.376536 0.070086 0.07099
C  4.112816 0.946713 0.178742
C  5.127098 -0.039635 -0.097029
C  4.465172 -1.227047 -0.374383
C  -4.471112 -0.662356 0.082877
H  -3.596388 1.218406 -0.43142
H  -3.520135 0.832565 1.280562
H  -1.929803 -1.115374 -0.143287
H  1.411976 1.863569 0.485973
H  0.423932 -0.993013 -0.195172
H  4.270566 1.9927 0.435508
H  6.20478 0.10918 -0.091197
H  4.791016 -2.230517 -0.634426
H  -4.669962 -2.581634 -0.350876
