program: Gaussian 09
title: 000013256
version: EM64L-G09RevD.01
frameworkgroup: C1[X(C15H12)]
method: RPBEPBE
basis: SDD
operation: Freq
keyword: #p
keyword: freq=noraman
keyword: PBEPBE/SDD
title: #p freq=noraman PBEPBE/SDD
converged: NO YES NO YES
title: Mulliken charges:
elementType: C C C C C C C C C C C C C C C H H H H H H H H H H H H
charge: 0.102705 0.196717 0.428267 0.418042 0.370208 -0.476963 -0.499572 -0.456236 -0.340721 -0.432910 -0.451607 -0.255822 -0.876126 -0.287042 -0.250098 0.235204 0.236669 0.240683 0.241530 0.225173 0.239738 0.229844 0.236992 0.235146 0.235154 0.225096 0.229929
chargesum: 0.00000
title: Mulliken charges with hydrogens summed into heavy atoms:
elementType: C C C C C C C C C C C C C C C
charge: 0.102705 0.196717 0.428267 0.418042 0.370208 -0.241759 -0.262903 -0.215553 -0.099191 -0.207737 -0.211869 -0.025978 -0.168834 -0.061946 -0.020169
polarizability: 2.57353562e+02 -5.82708584e+00 1.80493017e+02 2.90749647e-05 -1.90431484e-03 6.61885233e+01
1716.lowfreq: -3.8941 -0.0008 -0.0004 0.0008 8.1702 8.9106 22.5457 91.5379 184.4237
frequency: 22.3790 91.5308 184.4233 228.4449 249.2931 270.9959 322.6306 347.2953 395.1549 415.8317 469.3949 479.3518 504.7784 509.7755 531.6408 548.4475 574.3350 611.7798 659.5498 713.6775 732.1168 750.5554 782.7586 786.3661 817.2932 832.6408 848.1262 885.5501 910.8541 954.7588 955.5817 976.0416 984.1082 986.7023 993.4703 1026.9181 1043.6277 1053.7919 1112.9435 1134.2619 1169.5514 1175.4496 1180.7959 1229.7769 1234.7905 1253.8283 1279.2761 1300.3606 1365.7450 1389.1132 1398.2300 1407.0063 1415.7551 1436.4779 1453.3893 1487.6637 1496.2372 1502.7994 1535.6250 1579.1524 1605.0279 1620.4101 1636.1006 2973.6028 3055.1876 3078.9919 3117.1172 3120.2031 3120.6488 3128.8382 3132.7109 3143.7766 3157.4440 3158.3093 3253.8697
redmass: 3.1308 4.0386 3.5775 3.6845 4.7138 3.3548 3.3969 1.2263 6.0034 2.5570 3.2322 4.3016 4.2417 2.9878 6.6332 5.7626 3.1284 3.0462 5.9349 5.7833 2.8773 1.2128 1.2972 5.3123 1.9018 5.0933 1.8338 1.8217 1.4247 1.3846 2.4195 1.3558 7.3093 1.3600 1.4043 1.9987 1.5746 2.2476 1.9858 1.7563 1.2744 1.2072 1.1842 1.6591 2.1032 2.1208 1.9474 1.9799 4.8366 5.6832 1.3358 2.7030 1.9371 2.3513 2.2556 1.0488 1.1358 3.4948 3.8703 7.0606 5.5164 6.1476 6.9985 1.0375 1.0984 1.0974 1.0861 1.0865 1.0857 1.0915 1.0909 1.0989 1.0999 1.0995 1.0890
irintensity: 0.0079 0.3102 2.3402 4.0953 0.7117 4.1391 1.2170 3.3266 0.2948 1.5616 0.4932 0.0137 0.9543 5.2814 1.4604 0.9175 0.3425 0.9334 2.5937 0.5028 20.5981 80.5074 0.1987 2.2670 8.6545 1.1367 60.6813 15.8223 10.2138 3.6994 3.6961 1.1108 2.0013 0.7608 0.0329 0.3711 7.3256 5.2006 7.3464 6.2924 1.8269 5.1476 0.7247 3.7537 1.9823 3.8147 3.6710 3.8038 1.4261 0.4234 13.1014 0.2882 1.0401 8.4344 18.2948 13.8983 23.1631 3.7615 0.7002 3.4336 3.4941 1.2691 0.2247 27.0138 16.4194 29.4978 1.0795 1.8418 3.8570 21.6732 15.9530 37.9521 64.4245 14.7730 7.6509
temp: 298.150 k
press: 1.00000 atm
elementType: 6 6 6 6 6 6 6 6 6 6 6 6 6 6 6 1 1 1 1 1 1 1 1 1 1 1 1
symmnumber: 1
zpe: 575956.7 jmol-1
zpe.correction: 0.219370 hartree
zpe.thermalcorrener: 0.230410 hartree
zpe.thermalcorrenthalpy: 0.231354 hartree
zpe.thermalcorrgfe: 0.181951 hartree
zpe.sumelectzpe: -577.801845 hartree
zpe.sumelectthermal: -577.790806 hartree
zpe.sumelectthermalent: -577.789862 hartree
zpe.sumelectthermalfe: -577.839265 hartree
dipole: 0.0878 0.3870 0.0000
dipole: 0.3969
quadrupole: -76.0270 -74.8514 -94.8857
quadrupole: 0.5457 0.0002 -0.0004
quadrupole: 5.8944 7.0700 -12.9643 0.5457 0.0002 -0.0004
hfenergy: -578.0212156 hartree
pointgroup: C01 [X(C15H12)]
dipole: 0.0311567 -0.152994 -0.000019 debye
polarizability: 257.5742518|4.1162921|180.2723273|-0.0000713|-0.0019032|66.1885233 unknown
InChI: InChI=1S/C15H12/c1-11-5-4-7-13-10-9-12-6-2-3-8-14(12)15(11)13/h2-10H,1H3
charge 0 multiplicity 1
27 atoms
C  0.684334 -0.206019 0.000003
C  -0.795071 -0.285721 0.000007
C  1.280169 1.121933 -0.000006
C  -1.572554 0.942113 -0.000039
C  1.600521 -1.333414 0.000004
C  0.456017 2.308948 -0.000018
C  -0.916974 2.22697 -0.000048
C  2.695473 1.30438 -0.000025
C  -1.554492 -1.50308 0.000053
C  2.993225 -1.095627 -0.000018
C  -3.000931 0.90411 -0.000072
C  3.554066 0.205739 -0.000053
C  1.200981 -2.804005 -0.000041
C  -2.957933 -1.518419 0.000058
C  -3.698738 -0.307269 -0.000048
H  0.958211 3.283537 -0.000018
H  -1.53593 3.131772 -0.000075
H  3.091997 2.32642 -0.00004
H  -1.055083 -2.466827 0.000127
H  3.66628 -1.961091 -0.000044
H  -3.544876 1.856487 -0.000111
H  4.641192 0.337964 -0.00008
H  2.10743 -3.432506 -0.000099
H  0.612872 -3.080792 0.894659
H  0.612801 -3.080727 -0.894714
H  -3.481928 -2.480908 0.000105
H  -4.793858 -0.323467 -0.000066
