program: Gaussian 09
title: 000013254
version: EM64L-G09RevD.01
frameworkgroup: C1[X(C12H10O2)]
method: RPBEPBE
basis: SDD
operation: Freq
keyword: #pfreq=noraman
keyword: PBEPBE/SDD
title: #p freq=noraman PBEPBE/SDD
converged: YES YES NO NO
title: Mulliken charges:
elementType: O O C C C C C C C C C C C C H H H H H H H H H H
charge: -0.308181 -0.434234 0.325778 0.339825 -0.357752 -0.325892 -0.359874 -0.383190 -0.318582 -0.361426 0.278711 -0.206516 -0.193712 -0.254928 0.259310 0.266045 0.264392 0.255960 0.254890 0.221938 0.226242 0.228682 0.228893 0.353621
chargesum: 0.00000
title: Mulliken charges with hydrogens summed into heavy atoms:
elementType: O O C C C C C C C C C C C C
charge: -0.308181 -0.080614 0.325778 0.339825 -0.098442 -0.059847 -0.095481 -0.127230 -0.063692 -0.139488 0.278711 0.019725 0.034970 -0.026035
polarizability: 2.08977966e+02 1.31875299e+00 1.17291569e+02 -1.13478416e+01 1.90552428e+00 8.01945533e+01
1716.lowfreq: -1.4707 -0.0009 -0.0008 0.0001 6.9199 14.7257 29.1359 49.2976 74.5222
frequency: 29.0962 49.2920 74.5210 158.7349 206.7496 278.4562 314.6529 342.6297 345.0270 409.1622 411.4499 416.6355 482.3517 497.9504 516.3232 586.4360 609.6849 636.4468 691.3361 695.9609 721.2642 760.6587 793.4000 800.9013 831.8051 833.9595 853.2613 901.7457 927.1780 951.2812 967.5922 985.2960 985.6275 998.0128 1019.7202 1078.1450 1095.0095 1142.8985 1152.0636 1166.6832 1170.4406 1182.4575 1210.7241 1252.6501 1296.5772 1310.6351 1380.8501 1392.3419 1427.2699 1443.2498 1471.4792 1490.4806 1592.9005 1600.1786 1610.2731 1623.3575 3119.2242 3129.5317 3138.8863 3156.1545 3160.8247 3162.7599 3165.0917 3173.9701 3181.2759 3585.1958
redmass: 5.2350 4.1828 4.7900 6.2908 4.6878 6.3755 5.7785 1.1071 6.7182 4.0597 2.9460 3.0425 3.4672 2.7941 6.8526 4.7963 6.5134 6.9423 2.5161 4.1622 3.6146 1.6895 2.2609 2.0225 1.6010 1.2594 6.1939 1.4166 1.3358 1.3425 1.3587 1.2957 6.1818 2.7432 2.1033 1.5028 1.3478 1.4374 1.8649 1.1200 1.1195 1.4071 2.9739 3.6454 1.3539 1.3253 6.4822 7.4235 3.1759 2.3560 2.2520 2.6563 6.5340 6.6660 6.7294 6.4592 1.0898 1.0849 1.0892 1.0929 1.0886 1.0949 1.0956 1.1004 1.0975 1.0661
irintensity: 1.7000 0.3203 0.4948 0.5588 1.9168 0.4739 0.7461 144.5782 1.8839 18.0866 1.4200 1.5227 8.1208 42.0044 4.1662 2.4498 1.6933 1.4007 29.6322 0.3908 14.6924 92.1784 29.9075 21.7068 59.3040 3.3137 32.7065 5.4833 0.7064 0.0529 0.1946 0.5862 0.5201 8.5391 13.4907 9.3640 53.7939 265.5814 20.0357 13.2179 4.5033 26.4279 365.2080 24.0756 8.6698 6.2635 3.1268 19.0689 34.3638 5.9762 195.6049 210.3196 13.5941 33.9216 36.8706 9.9132 20.7291 1.9622 12.9504 30.4430 4.9335 4.4537 13.4414 8.5183 3.2938 43.0558
temp: 298.150 k
press: 1.00000 atm
elementType: 8 8 6 6 6 6 6 6 6 6 6 6 6 6 1 1 1 1 1 1 1 1 1 1
symmnumber: 1
zpe: 485373.9 jmol-1
zpe.correction: 0.184869 hartree
zpe.thermalcorrener: 0.196376 hartree
zpe.thermalcorrenthalpy: 0.197320 hartree
zpe.thermalcorrgfe: 0.146192 hartree
zpe.sumelectzpe: -612.725755 hartree
zpe.sumelectthermal: -612.714248 hartree
zpe.sumelectthermalent: -612.713304 hartree
zpe.sumelectthermalfe: -612.764433 hartree
dipole: 0.1716 -2.3327 -0.8265
dipole: 2.4808
quadrupole: -75.3603 -74.1953 -81.6794
quadrupole: 5.0363 2.2228 2.4757
quadrupole: 1.7180 2.8830 -4.6010 5.0363 2.2228 2.4757
hfenergy: -612.9106243 hartree
pointgroup: C01 [X(C12H10O2)]
dipole: 0.0761686 0.9332409 0.2754195 debye
dipolederiv: -2.2908075 -0.1197532 0.0580262 -0.2113468 -0.3907293 0.0293207 -0.2916941 0.0202756 -0.2027227 -1.4825702 0.3962039 0.0538167 0.5065937 -0.3287083 0.1625458 0.0198598 0.1714862 -0.3063809 1.495742 -0.1340529 -0.0230972 -0.6365018 0.0229664 0.011653 0.2467227 -0.0099123 0.0286603 1.6214855 0.309421 -0.0987928 0.8692647 0.243389 -0.0947853 0.0347788 -0.0568766 0.125935 -0.1372675 0.0649494 0.1071237 -0.1052908 0.0423378 0.074471 -0.0128131 0.116842 -0.0757147 -0.1701696 -0.1182917 -0.0325821 0.2411036 -0.0062666 0.0938226 0.086926 0.0494611 -0.0766999 -0.2673403 -0.0129951 0.0285057 -0.3606441 -0.176995 -0.0186711 0.1797635 -0.0042505 -0.1437917 -0.4612411 -0.0838403 0.0668151 0.0403662 -0.0026998 -0.0888171 -0.0360335 -0.1095904 -0.1179803 -0.1506211 -0.0252499 0.0026568 0.2882724 -0.0725511 0.118505 0.2006401 0.050577 -0.0911972 -0.2630349 0.140594 0.0941574 -0.1586174 0.002197 0.0842169 -0.1058452 0.1560452 -0.1159666 1.3060588 -0.451102 -0.0105317 -0.5413995 0.1970048 -0.0441777 -0.0033501 -0.046264 0.0270506 0.1475299 -0.0111976 0.0665809 0.082933 0.0706767 -0.1233645 0.0215029 -0.130469 -0.0445829 0.1570177 0.0287108 0.0346187 0.0055807 0.0355853 -0.1238488 0.0632384 -0.1056951 -0.0558532 -0.090989 0.0969905 -0.0238598 0.0518102 -0.132985 -0.0099957 -0.0185331 -0.0139484 -0.1968255 0.1141921 0.0559646 0.0077616 0.0525415 0.0102526 -0.0844494 0.0071268 -0.0821991 0.1122036 0.0316127 -0.0403976 -0.07391 -0.0616364 0.071925 -0.0498352 -0.1120739 -0.0456336 0.102596 0.0038848 0.0395985 -0.071775 0.0628501 0.0860574 0.0407626 -0.1186554 0.0328007 0.1134311 0.1175429 -0.0331942 0.0014448 -0.0208217 0.0043877 0.1022029 -0.0023494 0.0995116 0.1035489 -0.0020859 -0.0504717 -0.067874 -0.0436861 0.0835907 -0.0650446 -0.0747156 -0.0638084 0.1152378 0.0196731 0.0740681 0.0208187 0.0892872 -0.0314138 -0.1135332 0.0254111 -0.1040617 0.1073277 0.0698101 -0.008998 -0.0055599 -0.037317 -0.0400095 0.1270364 0.0165117 0.1230121 0.0713047 -0.0762903 0.0613229 -0.0816546 0.0615292 0.0745282 0.0652893 -0.0917086 0.0618437 0.0985481 -0.0898544 -0.0926622 0.0083421 -0.1045615 0.0631559 0.0490135 0.003955 0.0447391 0.1433128 0.3977221 -0.0856172 -0.0610314 -0.0703097 0.1743041 -0.1423172 -0.0386648 -0.1538853 0.2785589 unknown
polarizability: 208.9758406|-1.5356334|117.409233|11.2979191|-0.1939695|80.0790146 unknown
InChI: InChI=1S/C12H10O2/c13-10-6-8-12(9-7-10)14-11-4-2-1-3-5-11/h1-9,13H
charge 0 multiplicity 1
24 atoms
O  0.447326 -1.210306 0.224884
O  -4.798831 0.831901 -0.04013
C  -0.831596 -0.597722 0.134397
C  1.630284 -0.444879 0.073288
C  -1.829155 -1.312291 -0.5656
C  -1.144883 0.606743 0.803144
C  1.694732 0.748217 -0.685182
C  2.789917 -0.991706 0.668426
C  -3.147993 -0.819156 -0.607159
C  -2.464333 1.106189 0.754593
C  -3.464132 0.393364 0.048689
C  2.940947 1.397768 -0.834746
C  4.02696 -0.332093 0.506909
C  4.109506 0.866908 -0.240999
H  -1.5609 -2.248411 -1.063712
H  -0.373052 1.144822 1.361993
H  0.795853 1.154079 -1.159354
H  2.703204 -1.919924 1.241202
H  -3.937563 -1.354887 -1.141515
H  -2.709289 2.041364 1.27457
H  2.995672 2.31903 -1.425689
H  4.926512 -0.754775 0.967976
H  5.070896 1.376862 -0.362606
H  -4.926182 1.677402 0.457019
