program: Gaussian 09
title: 000013252
version: EM64L-G09RevD.01
frameworkgroup: C1[X(C10H14N2O2)]
method: RPBEPBE
basis: SDD
operation: Freq
keyword: #p
keyword: freq=noraman
keyword: PBEPBE/SDD
title: #p freq=noraman PBEPBE/SDD
converged: YES YES NO NO
title: Mulliken charges:
elementType: O O N N C C C C C C C C C C H H H H H H H H H H H H H H
charge: -0.363919 -0.261444 -0.702562 -0.374448 0.386130 0.386132 0.135181 0.440031 -0.581677 -0.581670 -0.851920 -0.851921 0.266428 -0.603505 0.243360 0.243364 0.225648 0.240253 0.222197 0.222191 0.240254 0.225654 0.321546 0.321547 0.329046 0.226474 0.271036 0.226594
chargesum: 0.00000
title: Mulliken charges with hydrogens summed into heavy atoms:
elementType: O O N N C C C C C C C C C C
charge: -0.363919 -0.261444 -0.059469 -0.045402 0.386130 0.386132 0.135181 0.440031 -0.338317 -0.338306 -0.163821 -0.163822 0.266428 0.120599
polarizability: 1.85914133e+02 9.04188129e-03 1.28702098e+02 -1.19296924e+01 3.42411594e-03 8.34051275e+01
1716.lowfreq: -28.2940 -0.0004 -0.0004 0.0005 2.2971 2.5791 7.3504 43.4414 61.8136
frequency: -28.2064 43.4257 61.7944 101.5959 122.9954 152.0794 185.0930 188.9063 209.9485 222.4568 239.7936 289.1478 295.9776 303.2659 338.1400 339.6508 372.8247 373.9659 495.7818 501.4047 503.3958 557.0403 558.8857 582.4917 629.4928 673.4447 691.0955 737.3265 768.9213 856.6888 874.8753 893.8294 911.9193 955.9288 1004.5068 1006.2354 1042.6010 1043.2796 1076.4843 1120.1667 1127.3152 1134.8638 1148.1818 1192.5909 1246.9775 1259.9611 1331.6055 1383.2709 1395.1901 1403.3248 1430.8387 1436.4115 1452.9275 1461.4093 1474.6441 1475.5143 1484.2469 1490.4994 1499.4964 1515.8839 1607.5663 1620.5921 1644.9129 1697.7630 2948.9458 2949.7958 2976.4576 3015.2114 3015.3046 3052.8467 3086.4052 3086.7179 3109.2286 3145.4183 3148.0411 3577.3999 3582.2080 3719.7769
redmass: 5.1567 4.1939 4.7829 1.1265 2.8517 3.0385 1.7397 1.0673 1.7119 2.3648 4.2274 2.7942 4.4005 1.2336 4.6140 3.4384 6.1596 1.0675 5.0805 4.0109 3.1660 3.2308 4.2952 1.1087 5.6520 5.2696 12.2469 3.8675 4.0064 3.1969 1.3132 1.7733 2.6396 3.6718 1.3527 1.8207 1.5343 1.4891 4.0300 1.9316 1.2803 1.7827 1.7094 2.3509 1.3013 4.0613 4.2695 2.3524 1.2875 1.9166 1.1599 3.0335 1.6187 1.3313 1.0462 1.0450 1.0441 1.2422 1.6347 1.4989 8.2004 3.1152 1.4188 9.4572 1.0396 1.0396 1.0354 1.0974 1.0974 1.1026 1.0951 1.0949 1.0980 1.0925 1.0925 1.0771 1.0447 1.1033
irintensity: 0.9767 8.2582 6.0196 0.1951 0.0472 1.9901 1.4278 0.0002 0.1616 0.0013 4.0538 1.2617 0.4042 270.8765 13.3755 0.6560 11.2302 0.0906 0.2834 0.7972 0.0041 8.1855 5.1807 125.2282 2.7716 2.0121 22.5948 7.7145 2.5938 14.3145 0.1925 47.6514 0.0560 33.4905 11.3720 49.2588 10.9428 0.0315 309.4558 10.2082 0.0246 180.6167 9.8043 242.8267 4.3433 29.2102 3.3489 0.0866 12.5790 14.7834 29.7598 6.6795 216.8271 65.1834 27.3169 0.0321 14.3997 12.8479 238.6610 47.5245 3.7265 8.5707 156.9678 275.5026 57.6391 42.5276 93.5271 0.0308 56.5987 40.0015 17.3740 14.8065 4.3329 9.2792 6.6308 37.9811 50.8197 24.3010
temp: 298.150 k
press: 1.00000 atm
elementType: 8 8 7 7 6 6 6 6 6 6 6 6 6 6 1 1 1 1 1 1 1 1 1 1 1 1 1 1
symmnumber: 1
zpe: 596078.9 jmol-1
zpe.correction: 0.227034 hartree
zpe.thermalcorrener: 0.241468 hartree
zpe.thermalcorrenthalpy: 0.242412 hartree
zpe.thermalcorrgfe: 0.186166 hartree
zpe.sumelectzpe: -648.384592 hartree
zpe.sumelectthermal: -648.370158 hartree
zpe.sumelectthermalent: -648.369214 hartree
zpe.sumelectthermalfe: -648.425460 hartree
dipole: -1.3422 0.0003 -1.4574
dipole: 1.9814
quadrupole: -49.9179 -75.1749 -90.3453
quadrupole: -0.0009 -9.2120 -0.0008
quadrupole: 21.8948 -3.3622 -18.5326 -0.0009 -9.2120 -0.0008
hfenergy: -648.6116261 hartree
pointgroup: C01 [X(C10H14N2O2)]
dipole: -0.5270975 0.0000057 -0.5743036 debye
polarizability: 185.9546522|0.0034505|128.7020966|-11.7542523|-0.0064203|83.3646097 unknown
InChI: InChI=1S/C10H14N2O2/c1-6-4-8(14-10(13)12-3)5-7(2)9(6)11/h4-5,12H,11H2,1-3H3
charge 0 multiplicity 1
28 atoms
O  1.666596 -0.000512 -0.839781
O  2.389876 0.000051 1.430444
N  -3.843704 0.000331 0.407702
N  3.885189 -0.000688 -0.389558
C  -1.775843 1.242481 -0.026971
C  -1.776085 -1.242434 -0.026344
C  -2.472505 0.000127 0.120072
C  0.282381 -0.000289 -0.462844
C  -0.39524 1.223105 -0.319343
C  -0.395479 -1.223478 -0.318727
C  -2.519397 2.555262 0.133341
C  -2.519887 -2.554993 0.134642
C  2.642761 -0.000357 0.204025
C  5.1214 0.00009 0.393766
H  0.156988 2.162125 -0.43324
H  0.156567 -2.162662 -0.432155
H  -2.962213 2.656855 1.14553
H  -1.843333 3.413399 -0.013986
H  -3.344785 2.655897 -0.601309
H  -3.345371 -2.655799 -0.599878
H  -1.844011 -3.413333 -0.012361
H  -2.962621 -2.656033 1.146922
H  -4.349193 0.871334 0.529733
H  -4.349353 -0.870516 0.53019
H  3.912116 -0.00083 -1.40922
H  5.732848 -0.897364 0.184002
H  4.844676 -0.004389 1.460255
H  5.728122 0.902321 0.190592
