program: Gaussian 09
title: 000161467
version: EM64L-G09RevD.01
frameworkgroup: C1[X(C6H5ClO5)]
method: RPBEPBE
basis: SDD
operation: Freq
keyword: #p
keyword: freq=noraman
keyword: PBEPBE/SDD
title: #p freq=noraman PBEPBE/SDD
converged: YES YES NO NO
title: Mulliken charges:
elementType: Cl O O O O O C C C C C C H H H H H
charge: 0.065091 -0.165603 -0.395697 -0.237282 -0.422932 -0.200777 -0.582697 0.194385 -0.135445 0.216891 -0.217424 0.245600 0.261463 0.283580 0.308196 0.383672 0.398980
chargesum: 0.00000
title: Mulliken charges with hydrogens summed into heavy atoms:
elementType: Cl O O O O O C C C C C C
charge: 0.065091 -0.165603 -0.012026 -0.237282 -0.023952 -0.200777 -0.037654 0.194385 0.172751 0.216891 -0.217424 0.245600
polarizability: 1.35799340e+02 -1.88169311e-01 1.00608128e+02 5.18538282e+00 1.85526476e+00 5.00330693e+01
1716.lowfreq: -3.4366 -3.2641 -0.0023 -0.0015 -0.0006 4.8680 23.6259 32.1022 46.5730
frequency: 23.6162 32.0814 46.5676 53.0062 102.7284 129.5806 168.0722 219.2351 292.0861 304.6411 396.5051 406.7762 413.0455 479.7585 544.3875 569.3342 586.6826 615.0826 641.9293 669.8282 714.0389 742.6457 860.3729 877.5178 921.0945 948.2000 963.5259 1042.9368 1081.1942 1124.5343 1181.0569 1251.1773 1296.3018 1317.8630 1342.4140 1433.6220 1572.9411 1622.2258 1645.8542 1652.6654 3013.5894 3134.3892 3135.9552 3506.8212 3534.6518
redmass: 9.4317 9.5777 8.9642 9.9684 7.0088 6.5448 8.5956 11.2590 8.6991 12.6358 3.7387 3.1063 8.8056 4.7449 3.7944 1.8811 1.5619 3.4020 3.3647 1.9899 6.4645 6.1921 5.2160 3.6297 1.9729 2.2059 4.1184 2.0483 2.1845 2.9973 1.3854 1.4069 2.4612 1.5429 1.9078 1.0972 10.7349 7.8508 8.8538 8.8331 1.0646 1.0920 1.0953 1.0640 1.0646
irintensity: 0.6076 2.6486 1.0405 2.8501 1.3161 1.2218 1.3043 0.9826 1.5961 0.3373 8.1805 16.4548 7.7737 7.0494 46.5338 68.7890 156.5009 81.3002 61.9062 73.0647 32.2844 12.0170 1.3746 21.5550 22.9430 26.6137 141.6466 224.0173 124.1464 344.1842 38.9023 2.8938 11.6798 152.8927 61.9562 24.5949 140.5289 297.9135 272.4814 31.3753 1.2209 15.7479 13.5136 38.4890 56.7914
temp: 298.150 k
press: 1.00000 atm
elementType: 17 8 8 8 8 8 6 6 6 6 6 6 1 1 1 1 1
symmnumber: 1
zpe: 278804.9 jmol-1
zpe.correction: 0.106191 hartree
zpe.thermalcorrener: 0.118586 hartree
zpe.thermalcorrenthalpy: 0.119530 hartree
zpe.thermalcorrgfe: 0.064134 hartree
zpe.sumelectzpe: -1066.901858 hartree
zpe.sumelectthermal: -1066.889463 hartree
zpe.sumelectthermalent: -1066.888519 hartree
zpe.sumelectthermalfe: -1066.943915 hartree
dipole: 2.6658 2.9930 0.9756
dipole: 4.1251
quadrupole: -74.2390 -77.7842 -70.2481
quadrupole: -2.2643 -3.5043 -1.4311
quadrupole: -0.1486 -3.6938 3.8424 -2.2643 -3.5043 -1.4311
hfenergy: -1067.0080492 hartree
pointgroup: C01 [X(C6H5Cl1O5)]
dipole: 0.7492483 1.2991723 -0.6202093 debye
dipolederiv: -0.1381631 -0.1301603 0.0530735 -0.3567353 -0.3629742 0.1894154 0.2020076 0.2461519 -0.098481 -0.6165219 -0.0424498 -0.0398809 0.0791042 -0.5574765 0.3023453 -0.2159803 0.1553568 -0.4718504 -1.2803791 0.1692372 0.183618 0.3381346 -0.4391796 -0.1331467 0.3599289 -0.0886755 -0.3170917 -0.7523617 0.1327694 0.0029166 0.210687 -0.5149673 0.1479309 -0.0523628 0.3225201 -0.7511191 -0.3351056 -0.024636 0.0504426 0.051478 -0.9781646 0.3624363 0.0080084 0.3504231 -0.613781 -0.9539595 -0.2423018 -0.051045 -0.0226032 -0.5137968 0.1209804 -0.2095993 0.0474896 -0.3974188 -0.5099785 -0.2980628 0.2544837 -0.3588116 -0.1954874 0.1538739 0.2959527 0.1882543 -0.3090479 1.7463621 0.5115575 -0.0211011 0.1699573 0.7108561 -0.4128558 0.4902317 -0.1542786 0.3697097 -1.0239339 -0.2559594 -0.063014 -0.1599681 -0.280998 0.1161235 -0.2382759 0.0188874 -0.1622377 1.5285419 -0.4245494 -0.2477094 -0.6125868 0.5043194 -0.1743642 -0.5386085 -0.4510983 1.1691131 0.0633189 0.3780806 -0.2579743 0.6637493 0.6487563 -0.3258407 -0.4225872 -0.3667026 0.1217 1.4077694 0.1652209 0.2590178 -0.1130944 1.028556 -0.4778249 0.4653752 -0.4147946 0.6688968 0.1057864 0.0553342 0.0219312 0.0595365 0.0258826 -0.0524682 0.029703 -0.0117653 0.0908759 0.0087054 0.00785 -0.0362264 0.040546 0.0862591 0.0483551 -0.0237246 0.0376454 0.0604716 0.20505 -0.0411717 0.0105451 0.043776 0.1124727 0.0264068 -0.0861707 0.005511 0.145734 0.3879567 0.0425072 -0.0283025 0.0255026 0.3548574 0.0985651 -0.0037552 0.0863069 0.1306223 0.1569125 -0.0032658 -0.090775 -0.0586722 0.371085 0.0100679 -0.0601432 0.0287686 0.363904 unknown
polarizability: 132.6064507|13.8380757|81.0472045|5.0596503|-24.9224822|72.7868817 unknown
InChI: InChI=1S/C6H5ClO5/c7-4(6(11)12)1-3(8)2-5(9)10/h1,9,11H,2H2
charge 0 multiplicity 1
17 atoms
Cl -2.066338 -1.789388 1.259512
O  0.891277 -1.270669 1.762515
O  3.754555 0.431879 -0.729017
O  1.843512 1.612588 -1.322326
O  -2.393213 1.442976 -1.088233
O  -3.914294 -0.227745 -0.53378
C  2.073454 0.704883 0.968546
C  0.833636 -0.223694 1.064841
C  -0.374387 0.239673 0.330222
C  2.501447 0.985184 -0.460658
C  -1.621203 -0.318427 0.338326
C  -2.768779 0.257878 -0.445475
H  1.805102 1.673602 1.432627
H  2.894171 0.241273 1.532616
H  -0.252556 1.135141 -0.291988
H  4.004964 0.614389 -1.676162
H  -3.164647 1.789854 -1.611466
