program: Gaussian 09
title: 000013246
version: EM64L-G09RevD.01
frameworkgroup: C1[X(C12H22O)]
method: RPBEPBE
basis: SDD
operation: Freq
keyword: #pfreq=noraman
keyword: PBEPBE/SDD
title: #p freq=noraman PBEPBE/SDD
converged: YES YES NO NO
title: Mulliken charges:
elementType: O C C C C C C C C C C C C H H H H H H H H H H H H H H H H H H H H H H
charge: -0.214807 -0.404754 -0.373641 -0.389611 -0.398076 -0.380557 -0.380681 -0.373367 -0.390718 -0.392879 -0.527972 -0.503645 0.219003 0.198376 0.190125 0.190209 0.196876 0.191171 0.192232 0.207485 0.201244 0.180818 0.196211 0.213499 0.196351 0.202243 0.229429 0.223886 0.194779 0.192994 0.212209 0.233990 0.223519 0.213411 0.230648
chargesum: 0.00000
title: Mulliken charges with hydrogens summed into heavy atoms:
elementType: O C C C C C C C C C C C C
charge: -0.214807 -0.016253 0.013444 -0.006209 0.010654 -0.003528 0.029169 0.058305 0.027946 0.012323 -0.070462 -0.059585 0.219003
polarizability: 1.36762878e+02 2.39596539e+00 1.31528066e+02 2.93761267e-01 9.81750562e-01 1.11236630e+02
1716.lowfreq: -0.0007 0.0004 0.0006 9.4904 16.9482 22.2760 60.1771 86.3421 107.7161
frequency: 60.0944 86.2685 107.6644 153.4372 165.0988 190.9270 208.8225 226.8617 235.8609 253.7382 271.5470 307.8309 314.2761 376.2082 389.2749 446.5716 452.2393 491.0561 563.0245 580.9746 699.7682 717.0147 728.6359 768.8675 781.9208 804.7031 815.2681 848.0316 868.1123 909.7764 929.1026 939.9275 956.8492 988.9179 1004.3790 1025.3531 1044.3142 1065.5358 1074.9327 1087.5510 1105.0489 1120.1989 1126.2972 1133.8368 1165.6836 1172.3496 1191.0296 1214.0614 1229.3689 1248.9799 1263.3059 1278.3202 1282.5620 1289.3522 1305.5986 1308.7575 1313.7285 1338.1018 1346.1339 1347.2444 1347.7243 1355.0860 1358.0222 1362.9397 1365.2804 1445.6647 1449.3350 1459.6553 1460.4292 1464.9938 1469.1912 1478.6202 1480.6550 1482.6439 1487.3690 1495.8602 1619.1602 2953.8879 2957.0568 2963.2925 2970.4770 2972.4497 2973.9249 2978.0500 2979.8437 2984.4811 2986.8960 2988.7072 3003.9315 3010.8785 3018.4535 3025.0564 3027.5411 3031.6107 3033.3208 3053.7524 3056.1347 3062.0422 3068.0320
redmass: 5.6866 3.0506 3.0622 3.3627 3.2711 2.0618 2.3968 2.1547 2.4646 2.2816 2.1317 2.0056 2.6349 2.1494 2.3128 3.0592 2.4802 1.9360 2.7254 2.5740 1.4803 1.4169 1.4717 1.7293 1.8728 1.7787 1.6633 2.2137 1.8465 2.1397 1.8607 1.8593 1.8996 1.8681 1.9452 2.3144 2.0925 1.8813 1.9282 1.5870 1.8486 2.3650 1.7247 1.6755 1.3199 1.4752 1.5742 1.4150 1.4274 1.2698 1.2747 1.2409 1.2366 1.2047 1.1309 1.2369 1.2220 1.4565 1.3910 1.3399 1.4104 1.3680 1.3955 1.4833 1.4527 1.0907 1.0946 1.0887 1.0833 1.0763 1.0826 1.0799 1.0862 1.0811 1.0868 1.0950 8.0948 1.0605 1.0606 1.0650 1.0616 1.0609 1.0654 1.0647 1.0631 1.0616 1.0668 1.0651 1.0982 1.0984 1.0936 1.0977 1.0968 1.0950 1.0972 1.0985 1.1002 1.0973 1.0973
irintensity: 3.9726 1.3803 0.3639 0.3494 1.3941 0.6675 0.8086 0.4194 1.4260 0.5698 1.3584 1.0370 1.0943 1.1583 0.7647 0.1064 1.8935 1.9273 2.2049 3.4663 4.7989 11.2425 14.8686 3.8142 1.3935 0.9121 3.7586 5.6170 2.5079 1.8247 1.5927 2.7018 5.8289 4.6597 4.0999 2.2187 1.7540 7.9467 3.5497 0.8723 9.2455 2.6623 1.3514 1.4342 1.1702 10.5947 7.8811 10.9013 27.3863 2.8890 2.2552 3.4381 0.8725 4.1849 0.7412 2.2122 1.6469 9.7109 3.4437 4.3084 4.6727 1.4902 5.1643 1.8315 2.9037 16.3044 16.2348 19.1674 3.2156 4.5451 12.0776 0.3119 1.4525 8.8202 4.6241 41.9908 89.0333 36.2967 26.4877 12.6666 15.0009 18.6490 18.9642 47.2440 54.7322 39.9084 29.7868 34.2683 10.3424 40.9657 38.5232 10.1412 21.9398 60.9983 66.5717 136.1292 57.2450 32.1179 47.6999
temp: 298.150 k
press: 1.00000 atm
elementType: 8 6 6 6 6 6 6 6 6 6 6 6 6 1 1 1 1 1 1 1 1 1 1 1 1 1 1 1 1 1 1 1 1 1 1
symmnumber: 1
zpe: 833816.0 jmol-1
zpe.correction: 0.317584 hartree
zpe.thermalcorrener: 0.331222 hartree
zpe.thermalcorrenthalpy: 0.332166 hartree
zpe.thermalcorrgfe: 0.278435 hartree
zpe.sumelectzpe: -544.627059 hartree
zpe.sumelectthermal: -544.613420 hartree
zpe.sumelectthermalent: -544.612476 hartree
zpe.sumelectthermalfe: -544.666207 hartree
dipole: -1.3268 -0.3841 -2.6372
dipole: 2.9770
quadrupole: -85.8766 -78.5872 -85.3290
quadrupole: 0.4475 -7.9619 1.0801
quadrupole: -2.6123 4.6771 -2.0648 0.4475 -7.9619 1.0801
hfenergy: -544.9446423 hartree
pointgroup: C01 [X(C12H22O1)]
dipole: 0.5275327 0.1474562 -1.035268 debye
polarizability: 136.690009|2.4824651|131.5791204|-0.1112264|-1.1981954|111.2584437 unknown
InChI: InChI=1S/C12H22O/c13-12-10-8-6-4-2-1-3-5-7-9-11-12/h1-11H2
charge 0 multiplicity 1
35 atoms
O  -2.55183 0.429548 1.27145
C  3.045187 -0.915931 -0.053949
C  1.832586 -1.626581 0.602293
C  2.791592 0.503076 -0.640467
C  0.610674 -1.801316 -0.332844
C  2.286581 1.590218 0.353241
C  -0.698125 -2.116722 0.431155
C  0.756611 1.649542 0.62248
C  -2.000426 -1.91538 -0.386462
C  -0.09172 2.021609 -0.616466
C  -2.183933 -0.484715 -0.959745
C  -1.627803 2.005063 -0.342647
C  -2.148649 0.631926 0.092389
H  3.857921 -0.843885 0.698343
H  3.437641 -1.556341 -0.871654
H  1.519777 -1.05502 1.498784
H  2.158796 -2.617793 0.978049
H  2.100657 0.433878 -1.503772
H  3.754921 0.850007 -1.066126
H  0.818041 -2.590926 -1.083961
H  0.475994 -0.866177 -0.905942
H  2.599646 2.584297 -0.02937
H  2.812984 1.456808 1.320872
H  -0.754048 -1.473206 1.330885
H  -0.669709 -3.159974 0.804836
H  0.567444 2.403127 1.414193
H  0.402148 0.688673 1.035313
H  -2.86112 -2.143269 0.269605
H  -2.035471 -2.631676 -1.231827
H  0.136288 1.337303 -1.456915
H  0.186351 3.036617 -0.963896
H  -3.18113 -0.421183 -1.447359
H  -1.450749 -0.269542 -1.758642
H  -2.153509 2.31073 -1.270461
H  -1.876419 2.729517 0.454117
