program: Gaussian 09
title: 000013245
version: EM64L-G09RevD.01
frameworkgroup: C1[X(C10H10O3)]
method: RPBEPBE
basis: SDD
operation: Freq
keyword: #pfreq=noraman
keyword: PBEPBE/SDD
title: #p freq=noraman PBEPBE/SDD
converged: YES YES NO NO
title: Mulliken charges:
elementType: O O O C C C C C C C C C C H H H H H H H H H H
charge: -0.255434 -0.436806 -0.261785 0.499992 0.323494 -0.373613 -0.369518 -0.353182 -0.359258 -0.265626 -0.318632 -0.537271 0.151800 0.230718 0.240168 0.243726 0.256140 0.262369 0.246093 0.225694 0.225701 0.250238 0.374992
chargesum: 0.00000
title: Mulliken charges with hydrogens summed into heavy atoms:
elementType: O O O C C C C C C C C C C
charge: -0.255434 -0.061814 -0.261785 0.499992 0.323494 -0.142895 -0.129350 -0.109457 -0.103119 -0.003257 -0.072539 0.164363 0.151800
polarizability: 2.62110144e+02 3.44203026e+00 1.15580284e+02 -1.29522607e-02 2.78808464e-02 5.22726274e+01
1716.lowfreq: -5.2998 -2.4011 -2.0705 -0.0008 -0.0006 -0.0003 45.4891 53.7944 80.0871
frequency: 45.4653 53.7500 80.0849 110.8072 152.4837 187.6722 200.5806 241.0995 253.2925 295.9444 372.6890 415.4726 443.8199 505.0505 510.2120 517.0599 583.1499 594.2349 632.8400 684.6522 741.4251 743.2423 812.7896 835.0400 835.7994 883.3270 940.2055 948.1475 966.7866 982.0060 999.1581 1013.2595 1049.9088 1112.2180 1113.2646 1156.4167 1177.5931 1216.6332 1236.8246 1246.4134 1298.3866 1318.4308 1339.2282 1382.4420 1432.6030 1439.0300 1469.2070 1470.3067 1504.3457 1569.0026 1610.3239 1635.1306 1647.1543 2967.4708 3058.9062 3098.5521 3131.8191 3132.5815 3141.0663 3163.3022 3166.1751 3172.6423 3527.3941
redmass: 5.1588 5.7939 5.6752 3.8129 3.3468 5.2723 1.7426 1.5510 5.3066 5.0800 3.5607 2.8859 4.7002 5.7586 2.2579 4.0407 1.2522 5.2122 6.9478 3.5598 3.9287 5.3207 1.3103 5.7110 1.6109 1.8622 5.1215 1.3831 1.3477 8.6867 2.6236 1.2125 2.1415 1.2585 1.3771 1.3405 1.2485 1.4434 1.7179 2.9532 1.5695 1.4148 2.4855 3.7402 3.1224 1.2805 1.0497 1.0745 2.5515 6.7324 6.5670 7.4646 5.6880 1.0327 1.1044 1.0899 1.0997 1.0900 1.0878 1.0920 1.0947 1.0957 1.0640
irintensity: 0.1388 0.0205 0.0042 4.1321 5.4213 3.7734 0.2008 0.6906 0.9656 2.0959 0.1020 0.0515 14.9674 21.2081 3.5903 67.7616 157.9273 4.3074 0.1436 28.4454 0.7263 0.5463 10.6129 20.4712 85.5447 3.0499 11.4024 1.5438 2.6716 53.9328 2.5933 42.8865 661.7775 0.1899 9.6748 0.6544 148.4422 12.2380 0.8113 249.4973 1.5715 6.1850 37.5608 92.9991 2.9710 11.3169 15.3388 74.1055 117.6001 3.9393 759.2867 108.1480 121.8497 72.6964 43.7569 2.1449 25.3316 8.0492 5.6201 2.6095 19.4291 5.9023 54.5860
temp: 298.150 k
press: 1.00000 atm
elementType: 8 8 8 6 6 6 6 6 6 6 6 6 6 1 1 1 1 1 1 1 1 1 1
symmnumber: 1
zpe: 463949.6 jmol-1
zpe.correction: 0.176709 hartree
zpe.thermalcorrener: 0.188978 hartree
zpe.thermalcorrenthalpy: 0.189922 hartree
zpe.thermalcorrgfe: 0.137285 hartree
zpe.sumelectzpe: -611.776403 hartree
zpe.sumelectthermal: -611.764134 hartree
zpe.sumelectthermalent: -611.763190 hartree
zpe.sumelectthermalfe: -611.815827 hartree
dipole: 4.0555 -2.6003 0.0039
dipole: 4.8175
quadrupole: -68.1516 -71.3820 -79.6392
quadrupole: -1.8174 0.0227 0.0108
quadrupole: 4.9060 1.6756 -6.5816 -1.8174 0.0227 0.0108
hfenergy: -611.9531123 hartree
pointgroup: C01 [X(C10H10O3)]
dipole: 1.5774138 1.0497301 0.0474403 debye
dipolederiv: -2.147861 -0.4030886 -0.027583 -0.3427098 -0.4050359 -0.0063483 -0.0261226 -0.0062364 -0.2956722 -1.0945632 0.5826941 0.0149163 0.8120898 -0.880558 -0.0087599 0.0226622 -0.0104819 -0.4415617 -1.1333572 -0.2079402 -0.013363 -0.5448137 -0.8782425 -0.0227288 -0.0250607 -0.0202225 -0.341581 -0.8178873 -0.0620254 -0.0085403 -0.1843147 -0.172427 -0.0078892 -0.0125478 -0.0070253 0.0058898 1.9173257 0.2697313 0.0225584 -0.0647426 0.1047236 -0.0002274 0.0114091 0.0019429 0.1118682 0.3738105 0.0724786 0.0061397 0.2399773 0.1122363 0.0104154 0.0114532 0.0089469 -0.1140898 0.4502937 0.0111494 0.0050133 -0.2064391 0.1276885 0.0085935 -0.0024642 0.0103352 -0.151305 -0.6709692 -0.0345822 -0.0045281 0.4749634 -0.0001047 0.0110114 0.0137208 0.0074217 -0.1977492 -0.5251705 -0.1075622 -0.006435 -0.5385757 -0.0281037 0.0010428 -0.0213892 0.0044442 -0.1699992 1.4158633 -0.0135267 0.0113129 -0.3065972 0.1350663 0.0044985 0.0010474 0.0069058 -0.0719799 -1.7015671 0.106491 -0.0081948 0.4656755 0.0052977 0.0107955 0.0045397 0.0080891 -0.2076891 0.6575904 0.1760755 0.0086964 0.6805642 0.4789531 0.0105362 0.0256185 0.0066895 0.3220328 2.7785864 -0.2870404 0.0101143 0.1219251 1.3439925 0.0391569 0.0244819 0.0359448 0.2366447 0.0330317 0.0953779 0.002816 0.068586 -0.0240113 -0.0056723 0.0019412 -0.0054015 0.1413719 0.0503122 -0.0985137 -0.0043126 -0.0571477 -0.0466577 -0.0076737 -0.0029905 -0.0079912 0.1516495 0.0276469 -0.0772696 -0.0040057 -0.1014065 -0.0435917 -0.0085911 -0.0048066 -0.0085737 0.1659518 0.024955 0.0806193 0.0018262 0.0826985 0.0063133 -0.0054316 0.0020412 -0.0054788 0.1721633 0.0784205 -0.0157687 -0.0010449 -0.0566019 -0.0320633 -0.0066425 -0.0029976 -0.0063852 0.1497528 0.0606766 -0.0595965 -0.002918 -0.082891 -0.0399795 -0.0079432 -0.0035692 -0.0078111 0.1756463 0.0701368 0.0377362 0.0826472 -0.1546875 -0.0422944 -0.089248 -0.0024006 -0.1044234 -0.0888465 0.0710906 0.0428889 -0.0789865 -0.1546569 -0.0556843 0.0891816 -0.0070838 0.1068679 -0.0754291 -0.1661159 -0.0002277 -0.0012389 0.042102 0.0834634 -0.0015315 0.0004166 -0.0016746 0.1259801 0.247751 -0.1081004 -0.00489 -0.1929977 0.2510194 -0.0065443 -0.0078991 -0.0058828 0.3969515 unknown
polarizability: 262.173174|-0.9389197|115.425239|1.5859975|2.2411667|52.3646423 unknown
InChI: InChI=1S/C10H10O3/c1-13-9-5-2-8(3-6-9)4-7-10(11)12/h2-7,11H,1H3
charge 0 multiplicity 1
23 atoms
O  4.136257 -0.113448 0.01964
O  -4.747082 1.286821 -0.001061
O  -4.452234 -1.02302 -0.078379
C  -0.104096 -0.328605 -0.019717
C  2.739593 -0.109209 0.009514
C  0.534317 0.943398 0.031799
C  0.7293 -1.48858 -0.055353
C  1.935502 1.062686 0.046657
C  2.127355 -1.388399 -0.041332
C  -1.556529 -0.501239 -0.037307
C  -2.515146 0.479335 -0.011355
C  4.828311 1.180081 0.066924
C  -3.941383 0.126734 -0.034575
H  -0.071172 1.855718 0.06126
H  0.261753 -2.479576 -0.095038
H  2.390603 2.056627 0.087391
H  2.766893 -2.275339 -0.068842
H  -1.925582 -1.537237 -0.075366
H  -2.280945 1.547207 0.026705
H  4.578501 1.734149 0.991866
H  4.583877 1.797311 -0.818601
H  5.898874 0.929996 0.061479
H  -5.701663 1.00639 -0.018208
