program: Gaussian 09
title: 000013244
version: EM64L-G09RevD.01
frameworkgroup: C1[X(C6H4N2O5)]
method: RPBEPBE
basis: SDD
operation: Freq
keyword: #pfreq=noraman
keyword: PBEPBE/SDD
title: #p freq=noraman PBEPBE/SDD
converged: YES YES NO YES
title: Mulliken charges:
elementType: O O O O O N N C C C C C C H H H H
charge: -0.217244 -0.196818 -0.177552 -0.196307 -0.220909 0.054133 0.106665 0.399560 -0.322999 0.281876 -0.292687 -0.270835 -0.141267 0.281459 0.302270 0.299574 0.311082
chargesum: 0.00000
title: Mulliken charges with hydrogens summed into heavy atoms:
elementType: O O O O O N N C C C C C C
charge: -0.217244 -0.196818 -0.177552 -0.196307 -0.220909 0.054133 0.106665 0.399560 -0.041540 0.281876 0.009583 0.028739 0.169815
polarizability: 2.25128805e+02 -1.23121330e+01 1.20253456e+02 -1.93864462e-03 -1.84875165e-03 3.70594957e+01
1716.lowfreq: -8.3165 -2.1852 -0.0007 -0.0001 0.0004 3.9974 47.0342 55.8541 64.9706
frequency: 47.0312 55.8513 64.9686 97.3857 173.9590 178.6505 182.9459 237.8226 352.1541 360.7293 413.4480 487.7574 550.7145 564.4415 619.6206 652.3418 681.2656 689.1989 730.5547 779.2752 820.3397 869.2914 909.1480 909.7103 924.3515 931.4168 974.4046 1029.0911 1133.0736 1175.2852 1196.3408 1224.4177 1228.2417 1266.1665 1285.0774 1352.2487 1366.1937 1379.8066 1483.4640 1538.4387 1646.3992 3148.0473 3207.7430 3232.0342 3261.5002
redmass: 12.7962 13.4240 11.1348 6.7216 3.2068 7.3457 9.2510 11.9779 3.5981 7.8301 9.2945 8.4194 5.1975 5.4565 4.3830 10.3930 7.7699 6.7177 11.3294 6.0673 1.3243 1.7909 1.3869 8.0758 6.0034 6.2589 1.1645 1.2450 3.6894 1.8740 9.3991 2.1323 2.9020 1.4494 7.7780 5.7973 6.5140 5.1222 8.5280 5.8655 6.7681 1.0908 1.0965 1.0970 1.1032
irintensity: 0.5140 2.7967 4.1401 0.0320 6.3132 0.2688 0.5308 2.1919 3.2082 1.6607 2.5580 0.3482 2.6713 1.4986 0.9628 15.3333 5.5473 3.4377 29.3334 0.4561 68.8242 7.0455 6.4480 8.1859 4.8980 40.6584 65.2945 33.5414 13.1175 84.7516 655.0508 37.9803 32.7832 13.5971 63.6955 62.4276 99.0257 82.8003 56.7896 12.8785 62.9145 3.5326 12.7207 0.2559 7.5611
temp: 298.150 k
press: 1.00000 atm
elementType: 8 8 8 8 8 7 7 6 6 6 6 6 6 1 1 1 1
symmnumber: 1
zpe: 271626.2 jmol-1
zpe.correction: 0.103457 hartree
zpe.thermalcorrener: 0.114659 hartree
zpe.thermalcorrenthalpy: 0.115603 hartree
zpe.thermalcorrgfe: 0.064374 hartree
zpe.sumelectzpe: -715.500870 hartree
zpe.sumelectthermal: -715.489669 hartree
zpe.sumelectthermalent: -715.488725 hartree
zpe.sumelectthermalfe: -715.539954 hartree
dipole: -1.7717 5.2705 -0.0005
dipole: 5.5603
quadrupole: -110.2286 -70.9872 -72.1929
quadrupole: -6.6070 -0.0027 0.0111
quadrupole: -25.7591 13.4824 12.2767 -6.6070 -0.0027 0.0111
hfenergy: -715.6043274 hartree
pointgroup: C01[X(C6H4N2O5)]
dipole: 0.6823448 -2.0775922 0.0594493 debye
dipolederiv: -0.0705714 0.077169 -0.0019637 0.119573 -0.5343625 0.0131979 -0.0031883 0.0128102 -0.0809247 -1.0561665 0.0292355 -0.0045646 0.0257195 -0.4400964 0.0057935 -0.0049579 0.0059169 -0.2262026 -0.4333068 0.0207861 -0.0016817 -0.2620647 -0.763618 0.0139543 0.0059435 0.0149601 -0.2052019 -0.7390381 0.24096 -0.0088664 0.220336 -0.7077552 0.0137189 -0.0083973 0.0137194 -0.2273121 -0.8449226 -0.1227936 0.0001601 -0.3195035 -0.6235914 0.0085715 0.0057992 0.0097868 -0.2305745 1.8525627 0.2385801 0.0012638 0.8142133 1.310473 -0.0257903 -0.014014 -0.0285182 0.2086078 2.1470983 -0.2518653 0.0162468 0.0831092 1.074929 -0.0224112 0.0068996 -0.0242577 0.1942779 -0.2421463 0.0551111 -0.0031371 -0.113416 0.1907377 -0.0038837 0.0009887 -0.0025788 0.0774737 -0.1067242 -0.0607847 0.0018924 0.0901486 0.0891623 -0.0066551 -0.0023882 -0.0074021 -0.1656874 -0.6722514 -0.218384 0.0021072 -0.7297418 -0.1751525 0.0041794 0.0162521 0.006684 0.1140785 0.1537828 0.0319576 0.0003782 0.0492685 0.1301978 -0.0063485 0.0000565 -0.0064074 -0.1105307 0.7060735 -0.1731614 0.0085923 -0.3303513 0.1323976 -0.0068391 0.0128406 -0.006011 -0.061082 -0.992528 0.184268 -0.0094638 0.5044794 -0.0669216 0.0019207 -0.0182114 0.0004142 -0.0819596 0.0987794 -0.0577637 0.0011448 -0.0538728 0.0614446 0.0034546 0.0011204 0.0033439 0.1952378 0.0807035 0.0213575 -0.0011726 -0.0022385 0.1483153 0.0015419 -0.0005271 0.0017101 0.2035776 0.1077729 -0.024655 0.0002757 -0.0144213 0.0769455 0.0028943 0.0001897 0.0027679 0.185304 0.0108821 0.0099829 -0.0012113 -0.0812374 0.0968948 0.0027007 0.001594 0.0030619 0.2109182 unknown
polarizability: 224.9448583|-13.0234153|120.3683953|1.265917|-2.3201766|37.1285028 unknown
InChI: InChI=1S/C6H4N2O5/c9-7(10)4-3-5-1-2-6(13-5)8(11)12/h1-4H
charge 0 multiplicity 1
17 atoms
O  0.713985 0.283008 0.013057
O  4.29277 0.354581 0.028807
O  2.757613 2.06936 -0.024685
O  -4.183821 1.653109 -0.046111
O  -4.288694 -0.637068 0.013355
N  3.082959 0.822201 0.010001
N  -3.635778 0.480748 -0.013098
C  -0.087551 -0.884413 0.041111
C  0.744898 -2.014494 0.07718
C  2.032924 -0.166154 0.03196
C  2.100466 -1.555996 0.070237
C  -1.516001 -0.740521 0.030202
C  -2.175345 0.453895 -0.005544
H  0.405326 -3.048034 0.10448
H  3.012474 -2.146249 0.090727
H  -2.111218 -1.661169 0.052316
H  -1.716208 1.443394 -0.030296
