program: Gaussian 09
title: 000161366
version: EM64L-G09RevD.01
frameworkgroup: C1[X(C16H14N2O3)]
method: RPBEPBE
basis: SDD
operation: Freq
keyword: #p
keyword: freq=noraman
keyword: PBEPBE/SDD
title: #p freq=noraman PBEPBE/SDD
converged: YES YES NO NO
title: Mulliken charges:
elementType: O O O N N C C C C C C C C C C C C C C C C H H H H H H H H H H H H H H
charge: -0.230313 -0.225940 -0.422726 -0.451834 -0.193355 -0.022180 0.126712 0.406319 0.443252 0.180958 -0.339446 -0.381937 -0.406855 -0.387958 -0.302212 -0.235227 -0.237428 -0.224536 -0.233878 -0.241658 -0.240866 0.339238 0.261072 0.257608 0.258698 0.247303 0.228345 0.262823 0.229695 0.231730 0.230237 0.231469 0.232082 0.234590 0.376218
chargesum: 0.00000
title: Mulliken charges with hydrogens summed into heavy atoms:
elementType: O O O N N C C C C C C C C C C C C C C C C
charge: -0.230313 -0.225940 -0.046508 -0.112596 -0.193355 -0.022180 0.126712 0.406319 0.443252 0.180958 -0.078374 -0.124329 -0.148157 -0.140654 0.188956 -0.005533 -0.005698 0.005701 -0.002409 -0.009575 -0.006276
polarizability: 1.98361061e+02 1.35096519e+00 2.05023761e+02 1.56214330e+01 7.11577023e+00 1.54879521e+02
1716.lowfreq: -10.4585 -6.9340 -4.1099 -0.0006 -0.0005 -0.0004 18.2198 37.1699 42.0037
frequency: 17.3153 37.1491 41.9943 52.5904 67.5735 85.2411 95.1279 139.5422 153.8367 215.6911 239.3611 241.0573 262.4313 299.6728 311.2086 335.1573 349.5975 398.9720 404.1134 466.9670 489.4549 494.6160 501.9742 518.2372 588.8872 601.1069 615.2478 616.4220 660.3705 669.1640 683.6421 700.8898 704.2738 706.5708 727.8974 770.6320 779.6305 851.6094 858.5917 860.3860 907.1964 927.5922 930.2017 952.1831 978.7769 983.2700 985.2254 990.2814 991.4067 999.5937 1000.5046 1021.9477 1029.2163 1040.2557 1066.2026 1089.7164 1101.8617 1114.8047 1173.6287 1175.8286 1180.5166 1192.2868 1196.9878 1204.8166 1221.2293 1296.7969 1316.5348 1318.4907 1326.0261 1348.0763 1359.5846 1377.8642 1382.5993 1412.0985 1434.6284 1438.0175 1463.6857 1479.4155 1482.6792 1590.5760 1594.0954 1608.5333 1610.8062 1638.5006 1716.0782 2998.9595 3121.2939 3124.4867 3128.1107 3131.9656 3136.8380 3143.3005 3148.6239 3153.4024 3156.7260 3167.9445 3168.6557 3532.3949 3600.9425
redmass: 3.7945 6.1026 4.4612 5.1915 4.9265 6.4302 4.6839 8.5741 8.7378 4.7371 4.5935 2.6954 6.6747 5.5279 5.5600 6.6394 6.1740 2.7882 2.8366 2.4017 1.6656 1.5300 3.6352 2.1528 7.7210 7.5612 6.3820 6.4009 5.5047 5.3437 7.0015 1.7641 5.6547 1.8134 5.6530 2.0212 2.0977 1.2554 1.3112 4.4079 3.8488 1.6020 1.6486 2.2561 1.3983 1.7467 2.7225 5.9067 5.7837 1.3292 1.3392 2.9197 2.1735 2.4222 2.5619 1.6112 2.1196 2.6255 1.0965 1.0533 2.2521 1.3370 1.1392 3.8130 3.6045 1.7561 1.7840 1.8519 1.3715 1.4790 1.5946 6.9677 9.2029 1.3519 2.2193 2.2293 1.0966 2.1941 2.1824 6.0671 6.2901 6.0256 6.0108 11.0145 9.9494 1.0666 1.0991 1.0865 1.0848 1.0871 1.0879 1.0918 1.0922 1.0960 1.0961 1.1015 1.1014 1.0658 1.0800
irintensity: 0.0837 0.4027 0.1457 2.1698 0.6614 0.0748 1.3526 3.9244 2.3651 0.3481 1.6596 5.1254 2.8847 0.4013 0.8417 27.3951 2.9671 0.0228 0.6170 46.3381 67.2533 158.6392 47.6176 80.3965 31.8027 36.2752 1.4395 1.8564 21.6680 2.8661 11.4802 42.3652 16.9839 58.9807 47.3492 33.7988 36.2005 0.1761 2.5717 9.7229 10.6196 1.9207 4.5583 51.1274 0.1252 37.8417 96.2179 4.3337 2.5669 0.0744 1.5519 4.7418 10.8801 4.0417 12.6232 5.6574 34.3226 57.8493 0.2997 0.0557 4.8621 4.0149 1.0720 11.0465 80.0888 57.0428 75.9050 111.2468 14.5060 58.3503 81.5961 0.2439 0.1935 40.3709 20.8540 7.0652 30.4183 14.8799 17.5678 0.8732 0.5867 5.2618 5.8585 399.1663 405.7363 47.1818 1.0648 3.4041 0.2846 0.0996 4.3725 13.7671 17.6587 27.1451 23.2046 21.9259 16.1930 14.1240 45.4853
temp: 298.150 k
press: 1.00000 atm
elementType: 8 8 8 7 7 6 6 6 6 6 6 6 6 6 6 6 6 6 6 6 6 1 1 1 1 1 1 1 1 1 1 1 1 1 1
symmnumber: 1
zpe: 705667.9 jmol-1
zpe.correction: 0.268775 hartree
zpe.thermalcorrener: 0.286708 hartree
zpe.thermalcorrenthalpy: 0.287652 hartree
zpe.thermalcorrgfe: 0.220717 hartree
zpe.sumelectzpe: -951.825405 hartree
zpe.sumelectthermal: -951.807472 hartree
zpe.sumelectthermalent: -951.806528 hartree
zpe.sumelectthermalfe: -951.873462 hartree
dipole: -4.5582 0.8794 -0.1006
dipole: 4.6433
quadrupole: -126.7192 -108.8692 -125.0421
quadrupole: 4.6338 -5.0492 8.6459
quadrupole: -6.5090 11.3409 -4.8319 4.6338 -5.0492 8.6459
hfenergy: -952.0941794 hartree
pointgroup: C01 [X(C16H14N2O3)]
dipole: -1.798607 -0.318198 0.0329455 debye
polarizability: 198.209841|-0.5772709|204.3832834|-15.6907688|9.3870458|155.6712189 unknown
InChI: InChI=1S/C16H14N2O3/c19-11-18-14(20)16(17-15(18)21,12-7-3-1-4-8-12)13-9-5-2-6-10-13/h1-10,17,19H,11H2
charge 0 multiplicity 1
35 atoms
O  1.088575 0.470409 2.033393
O  2.491519 1.923691 -2.210394
O  4.062615 0.787352 1.319625
N  0.590505 0.672701 -1.501387
N  2.05867 1.325555 0.068934
C  0.006979 0.153268 -0.239615
C  1.074914 0.655587 0.788984
C  -0.007083 -1.390937 -0.183693
C  -1.386274 0.774842 -0.004025
C  1.782264 1.361808 -1.345116
C  -0.65954 -2.035307 0.898181
C  -2.50566 0.219034 -0.675557
C  0.67245 -2.170112 -1.149148
C  -1.564563 1.935127 0.787514
C  3.289928 1.840014 0.696443
C  -0.644493 -3.441901 0.999977
C  -3.777306 0.821272 -0.56836
C  0.681023 -3.580502 -1.048576
C  -2.839493 2.533453 0.900819
C  0.021797 -4.220808 0.024187
C  -3.948556 1.982758 0.22028
H  0.090127 0.666342 -2.388635
H  -1.167539 -1.434549 1.659796
H  -2.384537 -0.695523 -1.268117
H  1.19965 -1.677027 -1.972489
H  -0.718999 2.367337 1.33293
H  3.003005 2.619686 1.428957
H  3.908201 2.265439 -0.107493
H  -1.148799 -3.930427 1.840944
H  -4.633209 0.382808 -1.093089
H  1.207193 -4.174762 -1.803768
H  -2.966527 3.42668 1.522193
H  0.031117 -5.313526 0.103588
H  -4.936136 2.448702 0.308257
H  3.563284 0.457618 2.11276
