program: Gaussian 09
title: 000161356
version: EM64L-G09RevD.01
frameworkgroup: C1[X(C9H14NO4PS)]
method: RPBEPBE
basis: SDD
operation: Freq
keyword: #p
keyword: freq=noraman
keyword: PBEPBE/SDD
title: #p freq=noraman PBEPBE/SDD
converged: YES YES NO NO
title: Mulliken charges:
elementType: S P O O O O N C C C C C C C C C H H H H H H H H H H H H H H
charge: -0.212449 0.877834 -0.501387 -0.455633 -0.464135 -0.290694 -0.211723 0.394916 0.440528 -0.478146 0.159734 -0.408351 -0.751903 -0.630646 -0.477290 -0.474700 0.259423 0.283757 0.237982 0.243085 0.237248 0.294643 0.230105 0.229563 0.241227 0.246722 0.241536 0.243582 0.251438 0.243734
chargesum: 0.00000
title: Mulliken charges with hydrogens summed into heavy atoms:
elementType: S P O O O O N C C C C C C C C C
charge: -0.212449 0.877834 -0.501387 -0.455633 -0.464135 -0.290694 -0.211723 0.394916 0.440528 -0.218724 0.159734 -0.124593 -0.033588 0.123665 0.252195 0.264053
polarizability: 2.08902610e+02 -2.09288869e+00 1.65883850e+02 -2.76519264e+00 3.56693354e+00 1.21922960e+02
1716.lowfreq: -12.6517 -9.3610 -0.0028 -0.0023 -0.0022 5.3602 12.6916 35.4874 37.7496
frequency: 7.9930 35.1431 37.3497 47.4766 80.5252 91.0875 96.8182 102.8703 112.9829 136.7873 149.2053 168.5528 189.1638 208.0177 219.3821 235.2740 255.5318 283.6883 313.5359 332.6230 371.9091 378.7309 403.0908 449.6545 478.5058 518.0540 543.1855 557.1462 611.9200 642.2829 682.7712 688.9409 699.5023 705.7711 759.6938 807.5963 853.7934 916.0874 958.1129 964.1837 980.9429 1021.4926 1045.1288 1111.9229 1113.2270 1113.7295 1116.6217 1131.6910 1133.2534 1151.9843 1169.0057 1215.4417 1237.3284 1352.2369 1401.2978 1407.9301 1422.7617 1424.7420 1440.5900 1456.5489 1457.8660 1459.7651 1461.6635 1468.8459 1469.6814 1480.3278 1500.1574 1558.0014 1581.1312 1647.2361 2983.8930 2984.7702 2987.9909 2992.1044 3059.0647 3083.1983 3090.1404 3094.4878 3110.9413 3111.4119 3133.0985 3137.8211 3193.7165 3201.1660
redmass: 4.9326 6.4203 3.2263 3.3095 2.9778 1.3933 1.9595 1.2397 1.2194 3.1597 5.3335 3.6785 2.3121 5.4554 1.6967 4.0687 4.4691 6.9283 5.9145 2.9911 5.4616 3.7188 7.2735 10.0036 8.0017 5.7848 3.9236 6.2408 4.8122 4.1037 8.6184 9.8439 8.0788 4.0601 5.7068 1.3746 1.5798 2.9508 10.7596 5.6826 5.0077 1.6147 1.5250 1.4194 1.7909 1.3004 1.3176 1.3036 1.2998 3.1312 2.9783 2.5435 1.6087 2.6062 1.6465 1.3634 1.1235 1.1196 1.5843 1.0509 1.0529 1.1191 1.0457 1.0514 1.0511 1.2461 1.0463 8.7913 6.8246 7.8835 1.0386 1.0303 1.0301 1.0333 1.0975 1.1024 1.1046 1.1050 1.0992 1.0984 1.1033 1.1035 1.0925 1.0936
irintensity: 2.4730 1.4401 4.7745 4.3474 2.7729 0.0560 1.2276 0.6135 0.3671 2.9742 1.4937 5.2428 3.1998 5.2321 2.1787 12.4725 0.4473 11.4031 11.5537 0.5013 7.2905 15.6829 8.0172 4.6140 7.1510 6.2284 14.3524 45.8743 0.0603 11.6430 179.1424 61.9934 123.1889 12.0175 109.8565 16.4043 50.3469 10.3555 232.8750 303.7791 8.3410 54.9095 8.2615 30.5658 94.7368 8.6214 0.9384 2.1179 0.2580 53.2071 4.7800 13.2703 42.3182 78.2555 44.8618 37.8792 4.3657 7.1695 51.9275 11.8160 9.5172 52.9788 8.3552 20.1816 13.5889 9.1313 31.2805 8.2665 285.9501 503.4403 12.7205 48.0421 42.8291 59.9684 11.6598 24.3429 22.5563 22.0121 9.0404 7.1452 13.7914 9.3647 1.2832 1.0561
temp: 298.150 k
press: 1.00000 atm
elementType: 16 15 8 8 8 8 7 6 6 6 6 6 6 6 6 6 1 1 1 1 1 1 1 1 1 1 1 1 1 1
symmnumber: 1
zpe: 590903.2 jmol-1
zpe.correction: 0.225063 hartree
zpe.thermalcorrener: 0.244486 hartree
zpe.thermalcorrenthalpy: 0.245430 hartree
zpe.thermalcorrgfe: 0.174042 hartree
zpe.sumelectzpe: -1445.048435 hartree
zpe.sumelectthermal: -1445.029012 hartree
zpe.sumelectthermalent: -1445.028068 hartree
zpe.sumelectthermalfe: -1445.099456 hartree
dipole: -0.0459 -4.4983 -0.3219
dipole: 4.5100
quadrupole: -81.2753 -105.2425 -118.7891
quadrupole: 14.9471 -1.9362 -2.9369
quadrupole: 20.4937 -3.4735 -17.0202 14.9471 -1.9362 -2.9369
hfenergy: -1445.2734981 hartree
pointgroup: C01 [X(C9H14N1O4P1S1)]
dipole: -0.0407287 -1.7711929 -0.0983447 debye
polarizability: 208.8961601|-2.912973|166.0675805|1.1171884|2.732658|121.7456798 unknown
InChI: InChI=1S/C9H14NO4PS/c1-7-5-8(6-9(11)10(7)2)14-15(16,12-3)13-4/h5-6H,1-4H3
charge 0 multiplicity 1
30 atoms
S  2.497307 0.177311 2.225743
P  2.445334 -0.113718 0.190128
O  1.042404 -0.885714 -0.504128
O  3.650259 -1.127903 -0.503912
O  2.567247 1.252807 -0.845863
O  -2.411186 2.514795 0.064694
N  -2.972555 0.217982 0.003003
C  -2.605465 -1.1198 -0.112301
C  -0.283612 -0.430644 -0.305417
C  -1.266137 -1.466369 -0.26364
C  -2.008122 1.311963 -0.037021
C  -0.626525 0.90803 -0.203353
C  -3.688807 -2.172606 -0.058589
C  -4.389105 0.60984 0.172098
C  4.025346 -2.377319 0.198679
C  3.590942 2.282889 -0.539146
H  -0.965631 -2.511115 -0.34648
H  0.113901 1.708081 -0.268508
H  -4.239695 -2.145305 0.900121
H  -3.243146 -3.173325 -0.167786
H  -4.431889 -2.038183 -0.866727
H  -4.404774 1.709047 0.236813
H  -4.810898 0.181586 1.097966
H  -4.9962 0.284641 -0.690538
H  4.196283 -2.187957 1.274494
H  4.957676 -2.699054 -0.287779
H  3.238304 -3.138829 0.062484
H  3.54272 2.578978 0.524704
H  3.326843 3.131884 -1.185854
H  4.595578 1.902707 -0.790885
