program: Gaussian 09
title: 000161355
version: EM64L-G09RevD.01
frameworkgroup: C1[X(C14H17NO7)]
method: RPBEPBE
basis: SDD
operation: Freq
keyword: #p
keyword: freq=noraman
keyword: PBEPBE/SDD
title: #p freq=noraman PBEPBE/SDD
converged: YES YES NO NO
title: Mulliken charges:
elementType: O O O O O O O N C C C C C C C C C C C C C C H H H H H H H H H H H H H H H H H
charge: -0.294340 -0.236927 -0.453636 -0.430395 -0.439947 -0.427888 -0.425123 0.006274 -0.155440 -0.201414 -0.093401 -0.064203 0.002350 -0.353466 -0.144765 0.490939 -0.417153 -0.317175 -0.204565 -0.383397 -0.340089 0.288114 0.208836 0.269988 0.243496 0.221357 0.220052 0.203835 0.233421 0.364787 0.336592 0.366866 0.252801 0.347369 0.233006 0.252620 0.225519 0.257191 0.357915
chargesum: 0.00000
title: Mulliken charges with hydrogens summed into heavy atoms:
elementType: O O O O O O O N C C C C C C C C C C C C C C
charge: -0.294340 -0.236927 -0.088849 -0.093804 -0.073082 -0.080518 -0.067208 0.006274 0.053396 0.068574 0.150096 0.157154 0.222402 0.083790 0.108035 0.490939 -0.184148 -0.064555 -0.204565 -0.157878 -0.082898 0.288114
polarizability: 2.37571299e+02 8.48006339e+00 1.56658601e+02 1.87631892e+01 -1.34921776e+01 1.52087697e+02
1716.lowfreq: -4.3802 -1.4924 -0.0008 -0.0007 -0.0007 6.4794 13.5771 17.1154 31.3811
frequency: 13.3749 16.9206 31.3317 40.6649 55.6715 79.4511 87.0476 97.0775 116.8799 135.4436 151.9331 174.7727 203.0198 219.9535 238.9035 251.3248 280.4459 301.8073 321.8127 335.8012 356.2248 375.3955 380.7018 387.4459 398.7651 402.7207 407.3709 412.1552 415.0266 444.9484 454.7042 464.3184 522.7610 534.5086 563.1276 573.0719 594.4535 602.7722 629.4687 640.9595 729.4311 786.6357 804.4526 832.2773 835.1217 843.1291 869.9091 916.6750 928.9092 931.6558 952.0221 962.1429 969.2458 978.5997 1005.2039 1007.2375 1023.6180 1031.9594 1051.5212 1076.7455 1079.0256 1096.8662 1107.7522 1119.2412 1144.6259 1179.4749 1182.7396 1183.1027 1195.5635 1202.7813 1220.0576 1242.3341 1254.1355 1258.4575 1263.8229 1286.3657 1290.8481 1303.6125 1328.6001 1329.0585 1333.8034 1340.9314 1347.3310 1365.7794 1375.7261 1380.5040 1402.3385 1406.7420 1432.0865 1460.6315 1508.6206 1598.4586 1627.8397 2184.8585 2911.0217 2924.5829 2935.2799 2973.7288 3002.6726 3008.0625 3068.0017 3098.9700 3118.9689 3142.9429 3147.0648 3177.6333 3524.2577 3544.4986 3551.3804 3554.7177 3580.3777
redmass: 6.0982 4.2113 6.8870 7.4426 7.5778 4.4492 8.7527 7.1357 8.4190 5.7041 6.3687 3.0522 5.6203 5.0161 4.4262 5.9168 4.5596 6.3627 4.3175 1.3629 4.2063 3.2725 1.1675 2.2141 4.0074 1.8903 3.8923 2.7399 1.5648 1.3571 2.8191 3.2423 3.5069 3.7994 5.4710 3.9088 4.6854 3.9477 6.3854 5.1827 3.8653 5.2875 1.4081 3.4675 1.7627 3.3118 4.9182 7.0399 2.2201 2.9056 3.0425 6.1773 1.4368 3.7730 2.7678 3.6784 2.6351 4.1326 2.8552 3.8031 2.5248 3.5117 1.4291 2.3022 1.3530 1.3039 1.3117 1.1145 1.2979 1.6264 1.1671 1.2102 1.8142 1.6925 1.1711 1.5794 1.2204 1.3008 1.2819 1.3010 1.3553 1.3730 1.3475 1.2085 1.5459 1.3245 5.4603 1.7197 2.8515 1.0829 2.8014 6.4895 6.4001 12.5849 1.0823 1.0823 1.0832 1.0687 1.0847 1.0827 1.0857 1.0952 1.0879 1.0962 1.0908 1.0962 1.0659 1.0657 1.0657 1.0655 1.0661
irintensity: 1.0535 1.3093 0.8487 0.6936 1.6699 4.5140 3.1414 4.8945 2.3357 0.8682 0.3521 1.1455 3.7955 20.7743 1.6076 6.4650 5.6762 3.7711 0.0995 68.1854 10.5989 17.0951 146.6749 61.5410 22.0523 79.0132 13.5424 14.8068 103.9845 124.1890 91.3662 45.7131 14.2026 25.4498 25.3939 9.8846 5.1443 36.4313 3.6730 1.2450 0.9720 1.7853 53.1321 7.9108 75.3928 43.2539 71.2035 235.2953 50.3784 214.4186 12.8509 134.7471 3.9675 55.1093 1.7560 36.7060 14.5655 139.0532 71.2633 5.4601 79.9349 18.7573 54.2531 5.2085 234.5478 20.7919 10.7188 14.8873 36.1411 12.5301 19.1390 18.7983 15.6993 49.6305 12.0268 24.8340 43.8209 9.1435 14.9121 7.3222 12.6404 4.8980 11.8949 21.1111 2.7603 20.4239 18.8468 17.1738 9.7970 5.6431 57.0481 25.3333 88.6236 1.8034 17.4577 23.4149 50.3162 52.2263 30.3680 11.6750 15.0643 16.2216 15.1973 13.6087 2.5871 3.0297 12.1225 19.7016 21.8153 5.9733 53.7084
temp: 298.150 k
press: 1.00000 atm
elementType: 8 8 8 8 8 8 8 7 6 6 6 6 6 6 6 6 6 6 6 6 6 6 1 1 1 1 1 1 1 1 1 1 1 1 1 1 1 1 1
symmnumber: 1
zpe: 780858.3 jmol-1
zpe.correction: 0.297413 hartree
zpe.thermalcorrener: 0.319674 hartree
zpe.thermalcorrenthalpy: 0.320618 hartree
zpe.thermalcorrgfe: 0.243512 hartree
zpe.sumelectzpe: -1123.262063 hartree
zpe.sumelectthermal: -1123.239803 hartree
zpe.sumelectthermalent: -1123.238859 hartree
zpe.sumelectthermalfe: -1123.315965 hartree
dipole: 0.7026 0.8704 -3.2651
dipole: 3.4514
quadrupole: -106.7502 -137.0327 -137.6443
quadrupole: -17.6633 18.3607 -8.0320
quadrupole: 20.3922 -9.8903 -10.5019 -17.6633 18.3607 -8.0320
hfenergy: -1123.5594767 hartree
pointgroup: C01 [X(C14H17N1O7)]
dipole: 0.2989372 -1.1642819 0.6315882 debye
polarizability: 232.4767606|4.5575253|167.3311011|-29.6469094|2.7438448|146.5097344 unknown
InChI: InChI=1S/C14H17NO7/c15-5-9(7-1-3-8(17)4-2-7)21-14-13(20)12(19)11(18)10(6-16)22-14/h1-4,9-14,16-20H,6H2
charge 0 multiplicity 1
39 atoms
O  1.581879 -0.960871 -0.646694
O  -0.163709 0.275507 0.323536
O  4.294948 0.860986 1.957777
O  5.346936 -0.747012 -0.273887
O  1.746172 2.100364 1.486858
O  2.340469 -2.613797 -2.887997
O  -6.260244 -0.411126 1.838068
N  -1.035736 2.032568 -2.564994
C  3.55095 0.622518 0.71896
C  3.914316 -0.733014 0.091369
C  2.062135 0.730421 1.097072
C  2.990367 -1.024176 -1.110597
C  1.192918 0.376832 -0.118588
C  3.164299 -2.429027 -1.693928
C  -1.1661 0.050909 -0.767358
C  -2.525628 -0.077811 -0.112153
C  -3.112824 -1.354259 0.04184
C  -3.200214 1.062329 0.396025
C  -1.103729 1.156746 -1.757762
C  -4.359103 -1.500428 0.685917
C  -4.44092 0.931686 1.04232
C  -5.020459 -0.352211 1.186236
H  3.778848 1.427102 -0.021422
H  3.826083 -1.53545 0.844316
H  1.845911 0.011039 1.913757
H  3.146322 -0.265026 -1.913156
H  1.315618 1.133642 -0.927795
H  2.917951 -3.175953 -0.909904
H  4.206178 -2.578563 -2.017984
H  5.250565 0.65553 1.786663
H  5.493839 -0.120287 -1.030623
H  2.367691 2.348001 2.219635
H  -0.898329 -0.886566 -1.292573
H  1.402464 -2.415209 -2.634841
H  -2.595409 -2.243565 -0.336485
H  -2.748073 2.054239 0.287897
H  -4.807443 -2.495638 0.798339
H  -4.973972 1.799735 1.439854
H  -6.590269 -1.342066 1.897399
