program: Gaussian 09
title: 000161323
version: EM64L-G09RevD.01
frameworkgroup: C1[X(C22H32O2)]
method: RPBEPBE
basis: SDD
operation: Freq
keyword: #pfreq=noraman
keyword: PBEPBE/SDD
title: #p freq=noraman PBEPBE/SDD
converged: YES YES NO NO
title: Mulliken charges:
elementType: O O C C C C C C C C C C C C C C C C C C C C C C H H H H H H H H H H H H H H H H H H H H H H H H H H H H H H H H
charge: -0.283337 -0.460622 -0.119717 -0.166142 0.330466 -0.522687 -0.591634 0.122706 0.438550 0.167861 -0.772530 -0.757116 -0.408409 0.180160 -0.641732 -0.837511 0.611858 -0.668657 -0.575281 -0.390921 -0.353467 -0.356609 -0.355498 -0.695989 0.247208 0.250027 0.221417 0.212845 0.266226 0.222308 0.229677 0.213680 0.232678 0.250448 0.230269 0.213425 0.207775 0.257397 0.220771 0.224595 0.222928 0.220208 0.208199 0.200578 0.212569 0.205745 0.354405 0.186986 0.190195 0.188145 0.190452 0.194353 0.195555 0.215303 0.210405 0.209486
chargesum: 0.00000
title: Mulliken charges with hydrogens summed into heavy atoms:
elementType: O O C C C C C C C C C C C C C C C C C C C C C C
charge: -0.283337 -0.106216 0.127491 0.083885 0.330466 -0.088425 -0.103099 0.122706 0.438550 0.167861 -0.096495 -0.062974 -0.200634 0.180160 -0.384334 -0.169218 0.611858 -0.448449 -0.166505 0.027392 0.023713 0.021988 0.034411 -0.060795
polarizability: 3.20162636e+02 -9.17641698e+00 2.47040113e+02 -1.49751433e+01 -2.80435379e+00 1.74050416e+02
1716.lowfreq: -6.1202 -0.0012 0.0004 0.0010 4.8858 11.0759 14.9241 25.9821 40.7150
frequency: 9.0289 25.5093 40.7140 56.6827 57.7971 66.3321 89.0573 108.6661 113.7722 120.1235 128.9727 165.9000 179.3945 191.3850 193.4205 214.5672 221.9631 227.0335 230.4405 239.0928 248.3085 258.6586 272.5329 280.3948 308.5648 312.8664 342.3769 352.6976 365.6667 396.0926 415.7652 427.3446 439.8317 461.2167 469.8105 489.2174 513.6751 535.4713 542.6262 594.3590 597.2782 632.5674 651.0335 656.2947 716.7446 722.5419 737.4350 757.7467 785.6789 788.6951 797.2128 812.0908 818.0419 868.1698 874.3486 877.7728 888.1778 905.0811 928.1072 935.2848 957.0352 971.4802 978.5576 985.2162 996.8807 1002.1363 1011.4900 1019.0083 1026.8782 1048.2287 1059.3750 1064.3377 1078.9296 1082.4198 1091.5641 1113.2112 1118.3176 1132.9156 1141.0679 1152.5665 1172.1958 1178.5599 1183.6891 1191.9700 1207.7830 1227.4497 1232.6873 1240.1129 1243.2874 1257.3869 1275.7528 1276.8550 1280.8631 1286.1474 1291.7936 1293.5309 1305.8193 1310.6360 1312.6513 1327.7964 1344.8075 1346.9202 1353.3287 1355.8907 1358.1827 1379.2339 1388.1467 1389.5827 1394.0526 1395.6564 1414.9378 1455.2931 1459.3206 1460.7295 1462.4478 1462.9091 1466.7983 1467.5401 1468.8976 1472.8482 1475.6427 1476.3384 1476.8909 1484.7058 1487.8459 1489.4998 1503.0385 1582.7205 1626.7826 1696.2371 2943.9096 2945.5012 2949.2708 2954.5905 2955.5908 2959.2628 2966.0707 2968.5833 2971.2157 2971.8529 2976.9442 2986.2805 2990.2960 2994.0048 3001.2112 3005.7956 3016.2861 3028.1224 3030.4596 3048.0295 3055.0313 3067.7375 3070.1644 3074.8915 3086.8218 3091.8142 3094.7756 3095.5343 3095.9251 3097.8308 3150.9961 3577.4095
redmass: 3.6655 4.4230 1.5886 3.0183 4.1560 3.3346 3.3982 1.9863 2.3657 3.4785 2.1840 2.2395 1.2057 3.2234 1.3715 3.0809 2.5591 1.1568 2.1823 1.4600 2.9699 2.0153 3.4094 2.8522 3.0400 2.7595 1.4976 3.7795 2.5147 3.2763 2.9767 2.7603 2.7657 3.0970 3.4677 3.6092 4.3795 5.7005 3.5178 4.2321 4.0393 4.0687 4.9264 4.4507 2.7118 1.0643 1.1037 3.2988 1.2866 1.2326 3.9996 2.2319 2.1819 1.5076 1.8117 1.5581 1.8872 2.0084 1.4657 2.0651 1.8694 1.9142 2.4703 1.4158 2.3649 2.2608 3.4588 3.6120 1.6750 1.8513 2.2146 2.7435 2.2626 2.5389 1.2909 2.3867 2.3537 2.3663 2.0371 1.2518 1.7826 1.4444 1.8424 1.6746 1.4905 1.2911 1.7439 1.8171 1.4326 2.5911 1.5372 1.2062 1.3461 1.0974 1.1444 1.2192 1.5700 1.4924 1.6737 2.3496 1.5148 1.5539 1.6568 1.7337 1.8422 1.2657 1.2162 6.0335 1.2432 1.2206 3.4590 1.0665 1.0557 1.0770 1.0737 1.0730 1.0757 1.0537 1.0783 1.0670 1.0649 1.0700 1.0485 1.0861 1.0603 1.0944 3.6295 7.1320 7.6756 6.4454 1.0729 1.0697 1.0588 1.0588 1.0505 1.0585 1.0589 1.0591 1.0365 1.0803 1.0602 1.0969 1.0362 1.0359 1.1001 1.0943 1.1017 1.0966 1.1042 1.1047 1.0906 1.1007 1.0993 1.0983 1.0991 1.1003 1.0912 1.0991 1.0990 1.0910 1.0917 1.0658
irintensity: 0.0154 0.1332 0.0022 0.0455 0.0219 0.5779 1.1994 0.1772 0.1883 0.1202 0.0358 1.8575 0.8161 0.8064 0.4329 0.9612 0.1533 0.0341 0.6260 1.3997 2.0549 2.4882 1.0482 1.9619 0.3650 13.4186 74.4911 3.3575 20.9988 0.8489 0.3985 1.4315 2.7697 2.8993 1.1526 2.7310 1.1391 1.4414 1.9724 10.8936 3.8676 3.8521 6.6134 8.1797 10.3928 10.8907 0.2813 1.1204 12.4249 1.5817 3.6267 31.6343 19.6118 18.7898 2.3314 4.9256 4.0035 4.3531 0.2382 2.7220 15.3533 29.0519 14.7414 3.8554 86.9752 33.5605 0.9793 10.8939 24.7874 7.3346 8.1248 2.2885 1.1411 34.6672 5.3690 63.9889 24.5742 24.4686 6.1570 15.8218 3.3583 23.5404 66.0028 2.3619 18.3505 12.9549 17.9472 30.0453 20.3250 40.3522 8.7937 0.4372 0.5830 0.4828 2.8623 5.4045 3.3467 11.7403 8.0043 21.3524 1.0132 0.7600 1.0229 7.9872 10.6324 36.8884 11.0628 8.7753 8.1861 42.8806 69.2056 2.5317 14.7272 3.7672 0.0284 0.0281 1.8337 3.3426 0.9980 18.5113 9.9723 3.8154 9.7118 2.2778 8.9140 22.6543 35.5275 93.6666 117.1933 4.6976 15.3806 19.9288 5.0322 10.7187 25.1624 30.4694 35.4584 29.3360 37.7428 48.5753 110.3340 2.2195 11.8131 22.7716 1.2481 47.4940 1.9793 25.5874 21.4286 88.5371 13.9871 94.7464 57.9899 26.3292 8.7508 17.6906 70.5068 36.0283 27.8640 16.0126 4.1960 24.3360
temp: 298.150 k
press: 1.00000 atm
elementType: 8 8 6 6 6 6 6 6 6 6 6 6 6 6 6 6 6 6 6 6 6 6 6 6 1 1 1 1 1 1 1 1 1 1 1 1 1 1 1 1 1 1 1 1 1 1 1 1 1 1 1 1 1 1 1 1
symmnumber: 1
zpe: 1276449.3 jmol-1
zpe.correction: 0.486174 hartree
zpe.thermalcorrener: 0.511875 hartree
zpe.thermalcorrenthalpy: 0.512819 hartree
zpe.thermalcorrgfe: 0.429612 hartree
zpe.sumelectzpe: -1006.145487 hartree
zpe.sumelectthermal: -1006.119787 hartree
zpe.sumelectthermalent: -1006.118843 hartree
zpe.sumelectthermalfe: -1006.202049 hartree
dipole: 0.5396 -0.9808 0.9101
dipole: 1.4427
quadrupole: -139.3952 -136.0611 -150.1475
quadrupole: -6.2170 -2.0426 0.5246
quadrupole: 2.4727 5.8069 -8.2796 -6.2170 -2.0426 0.5246
hfenergy: -1006.6316613 hartree
pointgroup: C01 [X(C22H32O2)]
dipole: 0.2113039 -0.3815511 0.3632501 debye
polarizability: 320.4144117|-9.0429158|246.9124349|-13.9208773|-3.6393448|173.9263171 unknown
InChI: InChI=1S/C22H32O2/c1-5-6-7-8-9-16-13-19(23)21-17-12-15(2)10-11-18(17)22(3,4)24-20(21)14-16/h10,13-14,17-18,23H,5-9,11-12H2,1-4H3
charge 0 multiplicity 1
56 atoms
O  -1.054186 1.925481 -0.767448
O  -0.883027 -2.648294 0.948973
C  -3.217211 0.956886 -0.115071
C  -2.56297 -0.359147 0.391289
C  -2.289539 2.185902 0.065518
C  -4.618622 1.11635 0.517002
C  -3.393644 -1.545444 -0.175323
C  -1.083152 -0.423199 0.023291
C  -4.886762 -1.375228 0.079155
C  -0.422165 0.685208 -0.575712
C  -2.870546 3.459673 -0.564393
C  -1.837765 2.433408 1.520528
C  -5.421379 -0.170635 0.42205
C  -0.279853 -1.571134 0.254471
C  0.921069 0.616163 -1.017157
C  -5.732737 -2.626023 -0.059848
C  1.675725 -0.55973 -0.827133
C  1.064963 -1.655206 -0.166133
C  3.135631 -0.628573 -1.250934
C  4.11353 -0.224448 -0.112221
C  5.595588 -0.287759 -0.542855
C  6.574598 0.112386 0.584061
C  8.058598 0.055079 0.154405
C  9.029615 0.457622 1.285496
H  -3.354761 0.850036 -1.212541
H  -2.661211 -0.401113 1.497771
H  -5.174198 1.926699 0.004301
H  -4.532972 1.43004 1.579911
H  -3.043149 -2.488362 0.279242
H  -3.204273 -1.641092 -1.266063
H  -3.217777 3.263878 -1.594103
H  -3.718326 3.840968 0.030724
H  -2.093636 4.24273 -0.604827
H  -1.302861 1.561345 1.933145
H  -1.157735 3.302181 1.556239
H  -2.705448 2.646317 2.169991
H  -6.498611 -0.098773 0.630981
H  1.359895 1.500387 -1.490352
H  -5.618204 -3.071708 -1.068425
H  -6.805271 -2.41922 0.102066
H  -5.416901 -3.403186 0.664357
H  1.642997 -2.571601 0.018832
H  3.306062 0.039526 -2.11761
H  3.386428 -1.65555 -1.584449
H  3.866267 0.801344 0.227379
H  3.949567 -0.888419 0.760636
H  -0.225271 -3.376383 1.075491
H  5.834724 -1.315603 -0.889085
H  5.751455 0.378027 -1.417742
H  6.421859 -0.55452 1.458463
H  6.334651 1.138986 0.93179
H  8.297791 -0.971095 -0.192536
H  8.210035 0.721312 -0.719434
H  10.08311 0.40699 0.953704
H  8.832317 1.491211 1.627723
H  8.918089 -0.210986 2.160115
