program: Gaussian 09
title: 000161302
version: EM64L-G09RevD.01
frameworkgroup: C1[X(C16H15ClO6)]
method: RPBEPBE
basis: SDD
operation: Freq
keyword: #p
keyword: freq=noraman
keyword: PBEPBE/SDD
title: #p freq=noraman PBEPBE/SDD
converged: YES YES NO NO
title: Mulliken charges:
elementType: Cl O O O O O O C C C C C C C C C C C C C C C C H H H H H H H H H H H H H H H
charge: 0.024047 -0.260627 -0.243620 -0.174231 -0.236487 -0.210183 -0.396616 0.068097 -0.130233 -0.554723 0.093571 0.401894 -0.723482 -0.004223 0.472401 0.183509 -0.510783 0.234494 -0.613312 -0.604641 0.484612 -0.529947 -0.531558 0.232407 0.287235 0.242558 0.217354 0.226743 0.250110 0.266392 0.239481 0.235034 0.251811 0.236002 0.367411 0.261445 0.224161 0.223897
chargesum: 0.00000
title: Mulliken charges with hydrogens summed into heavy atoms:
elementType: Cl O O O O O O C C C C C C C C C C C C C C C C
charge: 0.024047 -0.260627 -0.243620 -0.174231 -0.236487 -0.210183 -0.029205 0.068097 0.102173 -0.024930 0.093571 0.401894 -0.029274 -0.004223 0.472401 0.183509 -0.244391 0.234494 -0.613312 -0.365160 0.484612 0.192899 0.177946
polarizability: 2.92228009e+02 8.60092674e+00 2.11326933e+02 -1.50069765e+01 -2.19892685e+00 1.43447652e+02
1716.lowfreq: -12.2058 -8.9502 -5.1647 -0.0017 -0.0011 0.0015 26.1732 36.9151 43.7066
frequency: 26.0245 36.7479 43.6474 72.7136 85.6602 105.2478 119.3619 126.9216 148.6138 155.1393 166.4777 178.7134 190.9852 203.2368 215.4346 229.6771 237.9015 257.6988 268.7978 273.9499 301.5854 315.9939 319.1344 337.8786 348.2030 377.6793 393.8902 422.0266 435.0211 492.7296 516.3585 517.4770 546.6875 569.0450 579.0523 591.3937 605.3490 639.5931 646.8243 656.1292 697.8247 704.9549 750.6458 767.6907 814.1354 832.5106 858.0467 866.1343 886.2488 899.6731 923.2878 939.7375 965.6772 1000.9063 1015.2890 1043.2297 1060.1089 1092.5088 1102.3667 1110.2415 1113.6547 1141.0398 1153.7216 1156.9174 1169.2280 1185.4812 1192.5761 1222.3221 1234.9390 1252.9919 1282.0794 1320.8296 1334.9065 1336.9653 1351.3088 1378.7985 1394.3994 1415.9329 1432.6125 1434.2853 1440.4878 1465.6196 1467.7089 1469.1408 1470.9445 1471.9684 1486.4821 1512.4215 1582.7750 1595.6674 1603.7430 1614.8498 1635.5154 2967.2980 2978.3893 2992.5008 2994.5093 3005.3985 3060.1445 3074.2278 3074.7498 3083.6815 3107.6957 3139.6697 3141.5587 3148.9768 3158.8952 3582.0767
redmass: 6.0318 7.0017 4.5687 5.7976 4.6416 4.8504 5.5309 4.5025 4.9890 5.0936 2.3951 3.7514 2.3715 1.5619 2.1590 2.0413 1.3584 5.9151 3.1367 4.0159 5.3200 5.3657 7.3143 2.9064 2.9444 1.5390 8.1208 4.4268 5.6144 4.7561 7.3405 4.6827 3.3938 6.7768 4.5325 3.3770 6.7540 5.3400 5.4645 6.3684 6.6682 5.2314 2.9998 4.9398 4.5250 2.0281 5.0734 2.3060 2.6262 2.6226 4.1240 5.9406 3.6664 2.4123 5.7843 3.7113 1.7936 4.8035 2.7110 1.2589 1.2821 2.2395 1.5145 1.4694 1.7116 2.5071 2.7081 1.5145 2.1937 1.8580 2.0676 1.7612 4.8692 2.0027 1.7082 7.5810 1.2171 5.1625 1.1999 1.0826 1.3391 1.0495 1.0800 1.0536 1.0502 1.0473 1.0517 3.5562 9.7628 8.2630 7.9439 8.9177 11.5612 1.0329 1.0317 1.0369 1.0721 1.0742 1.1044 1.0993 1.1046 1.0995 1.0994 1.0996 1.1014 1.0906 1.0913 1.0662
irintensity: 1.6495 1.4259 1.3922 0.3237 2.8447 3.7283 3.2889 0.5564 1.1760 5.8110 1.6063 1.6138 1.5284 1.3292 0.1022 5.2772 0.8472 4.1079 4.5152 6.0242 4.3038 19.7403 2.2532 29.0999 3.5703 77.4962 2.1729 5.9283 9.6594 6.1752 11.6956 3.8285 0.2961 1.6329 8.8123 15.0534 25.3953 18.2446 2.1742 1.3034 3.5604 9.5003 17.0825 12.8081 46.4143 18.6323 6.8679 29.0149 5.7896 11.1115 88.7065 87.8523 48.3707 47.4136 187.0579 7.7157 24.9858 85.2623 40.4045 0.1177 0.5324 11.4074 4.1172 49.2860 234.4636 60.1835 196.0795 54.5380 21.1296 6.4878 7.7469 36.5709 93.9432 41.2835 35.3777 138.6351 22.9758 72.1700 6.3692 32.4958 8.7748 11.1374 68.7844 19.8544 16.1526 4.5663 10.7718 129.7145 204.2874 252.2286 88.5895 603.2026 242.1622 62.1126 39.3157 21.2941 16.7652 11.4345 38.9520 8.3079 26.4002 30.9439 15.4880 11.6600 12.7045 8.0157 4.0111 76.9702
temp: 298.150 k
press: 1.00000 atm
elementType: 17 8 8 8 8 8 8 6 6 6 6 6 6 6 6 6 6 6 6 6 6 6 6 1 1 1 1 1 1 1 1 1 1 1 1 1 1 1
symmnumber: 1
zpe: 735214.7 jmol-1
zpe.correction: 0.280029 hartree
zpe.thermalcorrener: 0.302232 hartree
zpe.thermalcorrenthalpy: 0.303176 hartree
zpe.thermalcorrgfe: 0.228770 hartree
zpe.sumelectzpe: -1528.372428 hartree
zpe.sumelectthermal: -1528.350225 hartree
zpe.sumelectthermalent: -1528.349280 hartree
zpe.sumelectthermalfe: -1528.423686 hartree
dipole: -8.0050 1.5182 2.0349
dipole: 8.3980
quadrupole: -137.9054 -145.2432 -124.6423
quadrupole: -28.1367 5.0194 -1.7483
quadrupole: -1.9751 -9.3129 11.2880 -28.1367 5.0194 -1.7483
hfenergy: -1528.6524562 hartree
pointgroup: C01 [X(C16H15Cl1O6)]
dipole: -3.1827985 -0.5863337 -0.6651959 debye
polarizability: 291.3021474|-9.605014|208.012342|16.1954759|-17.2424009|147.6881055 unknown
InChI: InChI=1S/C16H15ClO6/c1-7-4-8(18)5-11(22-3)16(7)15(20)12-10(21-2)6-9(19)13(17)14(12)23-16/h5-7,19H,4H2,1-3H3
charge 0 multiplicity 1
38 atoms
Cl -2.260142 3.29719 -0.454006
O  0.086201 1.296027 0.036821
O  1.194558 0.178173 -2.130113
O  0.59977 -2.257149 0.695313
O  5.203465 -0.727425 0.436485
O  -2.453852 -2.664512 0.609645
O  -4.737579 1.61534 -0.292588
C  1.060778 0.171901 0.26622
C  1.894086 0.494864 1.542523
C  3.083293 -0.497776 1.641886
C  0.145739 -1.109942 0.452979
C  1.933158 0.0286 -0.970612
C  2.377287 1.964685 1.569818
C  -1.230083 -0.635245 0.302445
C  -1.193448 0.762398 0.050571
C  3.95527 -0.500488 0.385667
C  3.269151 -0.282758 -0.899182
C  -2.486565 -1.303391 0.358786
C  -2.351283 1.527961 -0.145423
C  -3.667425 -0.551634 0.157277
C  -3.592658 0.849214 -0.09131
C  1.890508 0.005368 -3.415078
C  -3.729405 -3.390694 0.666717
H  1.229597 0.332419 2.414101
H  2.702902 -1.528264 1.780446
H  3.718195 -0.24956 2.510002
H  2.916471 2.151896 2.516007
H  3.069505 2.183561 0.737392
H  1.529202 2.665045 1.504173
H  3.884469 -0.406246 -1.796017
H  -4.651709 -1.030492 0.188823
H  2.695751 0.754925 -3.524053
H  1.117374 0.163674 -4.179592
H  2.310407 -1.014525 -3.495857
H  -5.556199 1.062206 -0.236183
H  -3.449401 -4.432904 0.873099
H  -4.264821 -3.329328 -0.299964
H  -4.370564 -3.005114 1.482384
