program: Gaussian 09
title: 000161301
version: EM64L-G09RevD.01
frameworkgroup: C1[X(C15H18O4)]
method: RPBEPBE
basis: SDD
operation: Freq
keyword: #pfreq=noraman
keyword: PBEPBE/SDD
title: #p freq=noraman PBEPBE/SDD
converged: YES YES NO NO
title: Mulliken charges:
elementType: O O O O C C C C C C C C C C C C C C C H H H H H H H H H H H H H H H H H H
charge: -0.268502 -0.269357 -0.216936 -0.204301 0.084632 -0.587519 0.341052 0.565559 -0.083600 -0.371159 -0.271894 -0.410949 -0.608795 -0.517812 -0.415612 -0.737816 0.347235 0.089865 -0.692868 0.259266 0.243274 0.246331 0.213111 0.219044 0.262633 0.221543 0.217511 0.229222 0.234832 0.233874 0.242900 0.217120 0.244460 0.222466 0.225828 0.234150 0.261214
chargesum: 0.00000
title: Mulliken charges with hydrogens summed into heavy atoms:
elementType: O O O O C C C C C C C C C C C C C C C
charge: -0.268502 -0.269357 -0.216936 -0.204301 0.084632 -0.084980 0.341052 0.565559 0.162731 0.060996 -0.009261 0.028105 -0.144741 -0.041038 -0.198492 -0.045062 0.347235 0.089865 -0.197504
polarizability: 2.31945324e+02 -1.40082933e+01 1.54758290e+02 1.88065686e-01 2.65697551e+00 1.16600370e+02
1716.lowfreq: -12.5742 -9.9914 -3.5129 -0.0009 -0.0006 -0.0003 29.9680 64.8766 87.2258
frequency: 29.6303 64.8693 87.1908 125.4342 141.4598 169.4611 172.7498 193.9606 228.0235 240.8992 268.6901 284.1643 298.6787 312.4665 327.4749 343.7491 403.4764 412.0893 424.5753 458.4707 488.1653 528.8370 542.1396 575.9658 591.6648 614.0936 633.3949 650.8956 673.7531 689.0659 709.4761 733.9813 754.7508 783.9385 790.3645 813.5023 836.4548 840.3232 866.8582 892.0606 907.6019 928.0737 951.4300 957.6106 980.1275 984.3371 985.5646 990.3187 1009.6942 1018.3698 1041.2457 1068.5584 1095.5389 1104.0316 1120.8489 1141.3797 1155.5967 1171.6668 1189.5203 1199.3265 1209.0056 1214.2377 1237.0067 1248.8135 1258.1828 1267.3346 1275.7762 1310.6144 1314.9391 1316.3993 1321.7500 1334.4352 1352.6844 1361.7217 1377.1973 1389.8840 1419.7497 1445.7537 1454.9767 1457.2976 1460.4018 1464.3095 1477.9993 1489.5607 1671.2825 1676.2865 1685.3485 2972.7264 2979.4848 2986.4704 3001.4798 3002.1818 3006.9788 3026.8681 3028.2942 3042.9503 3044.5284 3052.1615 3068.7706 3084.5236 3088.9584 3096.3872 3106.4957 3117.9905 3205.6612
redmass: 4.5843 5.9272 3.5692 5.1567 4.4899 2.9447 1.1292 3.1619 2.2772 5.2348 3.0364 2.8926 2.9097 3.0470 2.8174 3.7198 2.8593 3.1560 3.9744 4.9715 3.9438 3.3345 3.0643 3.5823 4.2604 3.3649 3.9547 2.3906 4.2093 4.6919 3.6048 3.5927 3.0881 2.3050 3.4865 3.2910 2.3042 1.5891 2.8316 2.3700 3.0632 2.2974 1.9262 7.0156 2.2132 1.5318 2.8260 1.7415 2.0656 1.9611 4.1814 1.9343 1.8966 2.3166 3.3949 1.6617 1.6438 1.9255 1.3484 1.3200 1.7254 1.9710 1.8882 1.8060 2.3929 1.7153 1.2039 1.3385 1.3297 1.4148 1.3563 1.5126 1.7389 1.5792 1.6906 1.3159 1.1725 1.0837 1.0888 1.0855 1.0555 1.0476 1.0850 1.0796 6.7413 8.3501 11.4409 1.0638 1.0647 1.0587 1.0845 1.0548 1.0417 1.0839 1.0630 1.0960 1.0961 1.1075 1.1036 1.0905 1.1006 1.0618 1.0997 1.1003 1.1155
irintensity: 1.7446 1.9272 0.0715 1.5923 0.7540 0.9965 0.9915 2.9026 3.2167 2.3879 4.7892 2.0172 4.1767 1.2789 1.6335 1.9410 0.4083 0.6530 1.7046 12.2622 1.1927 2.1219 0.3031 6.7381 5.9964 3.0183 7.1660 7.5111 1.3859 2.9768 2.0540 30.1937 0.4513 7.7213 12.0114 29.8074 15.4714 36.4059 21.4606 42.6755 87.4154 10.9973 4.4184 82.0510 13.4850 29.3349 8.4435 27.2969 6.3832 26.9862 169.2267 9.0043 8.7399 7.8306 32.8303 1.4874 10.6346 49.1567 9.1954 16.1894 41.9479 29.4349 8.7515 8.6134 59.3350 6.8329 2.4987 3.2527 6.6346 1.2329 3.7295 2.1434 18.3339 11.7918 4.6026 37.9182 22.7802 4.3852 8.7521 12.6800 9.9739 11.4627 11.3645 11.9868 34.9408 0.4313 276.0992 18.3837 19.0297 52.4666 18.7373 11.2952 36.8098 25.5447 4.3996 17.0178 26.1573 23.6275 21.2878 38.5595 10.4895 4.2518 18.3698 16.0677 2.7273
temp: 298.150 k
press: 1.00000 atm
elementType: 8 8 8 8 6 6 6 6 6 6 6 6 6 6 6 6 6 6 6 1 1 1 1 1 1 1 1 1 1 1 1 1 1 1 1 1 1
symmnumber: 1
zpe: 791951.2 jmol-1
zpe.correction: 0.301638 hartree
zpe.thermalcorrener: 0.318002 hartree
zpe.thermalcorrenthalpy: 0.318946 hartree
zpe.thermalcorrgfe: 0.258531 hartree
zpe.sumelectzpe: -881.829859 hartree
zpe.sumelectthermal: -881.813496 hartree
zpe.sumelectthermalent: -881.812551 hartree
zpe.sumelectthermalfe: -881.872967 hartree
dipole: 2.6682 5.0902 1.5630
dipole: 5.9559
quadrupole: -126.6607 -112.2475 -113.6980
quadrupole: -13.5935 -9.8105 -2.1352
quadrupole: -9.1253 5.2879 3.8374 -13.5935 -9.8105 -2.1352
hfenergy: -882.1314974 hartree
pointgroup: C01 [X(C15H18O4)]
dipole: -1.0832925 -1.9914855 0.5926475 debye
polarizability: 231.530457|-15.0699796|155.2019739|0.7033658|-2.542827|116.5715526 unknown
InChI: InChI=1S/C15H18O4/c1-9-11-4-3-10-5-6-14(2)17-8-15(10,19-14)7-12(11)18-13(9)16/h3,11-12H,1,4-8H2,2H3
charge 0 multiplicity 1
37 atoms
O  -2.219194 0.884542 -0.85177
O  -3.148738 0.768136 1.30317
O  2.48633 1.626979 -0.131519
O  4.788351 1.435243 -0.440727
C  -1.129388 0.33224 0.039446
C  0.140854 1.061158 -0.413502
C  -3.457196 0.516329 -0.145484
C  -1.14933 -1.190392 -0.118291
C  1.379069 0.784879 0.44294
C  -1.672269 0.775743 1.434837
C  1.922036 -0.682595 0.461936
C  -3.703919 -0.991567 -0.358151
C  -2.511261 -1.813134 0.198073
C  1.360588 -1.567942 -0.691515
C  -0.094475 -1.967611 -0.491112
C  -4.582819 1.437219 -0.583384
C  3.426891 -0.485845 0.356574
C  3.709929 0.913881 -0.106509
C  4.423077 -1.372884 0.597738
H  -0.06779 2.145648 -0.391223
H  0.351415 0.799744 -1.464671
H  1.234677 1.150664 1.477515
H  -1.389149 0.084947 2.24953
H  -1.338915 1.803105 1.675704
H  1.649187 -1.16807 1.415619
H  -3.822479 -1.161579 -1.444585
H  -4.641461 -1.292249 0.14383
H  -2.549127 -2.851706 -0.177204
H  -2.628548 -1.866025 1.299864
H  1.973479 -2.486738 -0.737733
H  1.516032 -1.056318 -1.662562
H  -0.299323 -3.04174 -0.614251
H  -4.278737 2.487178 -0.446437
H  -4.828615 1.268949 -1.645709
H  -5.482381 1.245131 0.025429
H  4.226594 -2.395356 0.939424
H  5.467205 -1.072563 0.452811
