program: Gaussian 09
title: 000161287
version: EM64L-G09RevD.01
frameworkgroup: C1[X(C8H10Cl2N2)]
method: RPBEPBE
basis: SDD
operation: Freq
keyword: #p
keyword: freq=noraman
keyword: PBEPBE/SDD
title: #p freq=noraman PBEPBE/SDD
converged: YES YES NO NO
title: Mulliken charges:
elementType: Cl Cl N N C C C C C C C C H H H H H H H H H H
charge: -0.062522 -0.049490 -0.285145 -0.584141 -0.542327 0.682055 -0.331821 -0.307400 -0.317003 -0.241093 -0.237312 -0.219742 0.218617 0.256703 0.203173 0.245791 0.244923 0.259698 0.259977 0.240530 0.265679 0.300850
chargesum: 0.00000
title: Mulliken charges with hydrogens summed into heavy atoms:
elementType: Cl Cl N N C C C C C C C C
charge: -0.062522 -0.049490 -0.040222 -0.017612 -0.067008 0.682055 0.117143 -0.307400 -0.317003 0.018605 0.022665 0.020788
polarizability: 1.47659720e+02 9.66937731e-01 1.39303827e+02 1.25093354e+01 4.74856231e-01 6.89386860e+01
1716.lowfreq: -9.7662 -3.6617 -0.0006 0.0007 0.0021 3.8057 29.9754 56.4149 84.8290
frequency: 29.8563 56.4026 84.8280 99.5943 115.5627 189.5803 194.7009 242.7641 288.3960 298.0251 357.4152 379.2374 381.0302 399.3176 460.7255 475.3078 519.4986 543.3433 609.0283 704.2381 715.0872 734.6324 774.0183 803.7557 822.5445 893.1999 965.7410 1009.0988 1030.8045 1042.0695 1068.1845 1070.1996 1153.7203 1155.4187 1173.7525 1211.7206 1215.5855 1240.0870 1268.8108 1288.3033 1356.5657 1366.9949 1417.9536 1431.5834 1467.9029 1471.0718 1490.5136 1560.0260 1593.6168 1648.9835 2895.8712 3006.7869 3064.8582 3086.5472 3151.5387 3172.3447 3183.6269 3337.5932 3420.0400 3601.5338
redmass: 6.2890 6.5912 2.1759 2.5680 5.9236 9.6021 4.5757 4.6119 8.0803 3.2470 1.5064 4.2022 5.1019 1.6365 2.4299 3.5455 5.4518 3.3465 5.7162 1.9376 5.8040 2.1397 1.4624 1.2287 4.5345 1.3587 1.3278 2.0865 3.7696 5.0802 2.4244 2.0826 1.9256 1.6777 1.2587 1.5900 2.0452 1.5397 1.2222 1.3166 1.3221 6.2933 2.2081 3.2262 1.1113 1.1156 1.0793 6.5593 8.1425 1.0866 1.0713 1.0628 1.0887 1.0995 1.0873 1.0930 1.0998 1.0744 1.0469 1.0973
irintensity: 1.0261 1.1144 7.6144 4.6338 0.7188 0.9236 0.0099 4.0286 1.6927 0.0969 70.9599 51.4149 30.8579 122.5683 27.2483 5.1106 0.0423 8.3372 2.7433 32.6381 62.8429 76.6068 55.6138 20.5811 1.3069 0.0084 0.7121 13.1163 25.7269 5.7165 22.5153 14.3892 5.0163 2.0050 3.9534 4.1386 0.2937 0.5996 3.4347 3.6341 12.2065 6.8412 58.6382 23.9578 5.1124 17.9777 5.5250 46.0814 5.8323 4.8178 72.5984 18.8815 7.0406 10.8270 3.7653 1.4182 7.4000 19.0363 19.9292 4.2673
temp: 298.150 k
press: 1.00000 atm
elementType: 17 17 7 7 6 6 6 6 6 6 6 6 1 1 1 1 1 1 1 1 1 1
symmnumber: 1
zpe: 441371.4 jmol-1
zpe.correction: 0.168109 hartree
zpe.thermalcorrener: 0.180717 hartree
zpe.thermalcorrenthalpy: 0.181662 hartree
zpe.thermalcorrgfe: 0.127579 hartree
zpe.sumelectzpe: -1339.527060 hartree
zpe.sumelectthermal: -1339.514452 hartree
zpe.sumelectthermalent: -1339.513507 hartree
zpe.sumelectthermalfe: -1339.567590 hartree
dipole: 0.3469 1.4382 0.5581
dipole: 1.5812
quadrupole: -65.6641 -87.7985 -87.3313
quadrupole: -5.0443 3.1719 0.5151
quadrupole: 14.6005 -7.5339 -7.0666 -5.0443 3.1719 0.5151
hfenergy: -1339.695169 hartree
pointgroup: C01 [X(C8H10Cl2N2)]
dipole: -0.1632893 -0.5630028 0.2082225 debye
dipolederiv: -0.2449559 0.2334247 0.0585169 0.1937687 -0.6807134 -0.0988899 0.0436896 -0.1013967 -0.0965856 -0.2341854 -0.2402769 0.0522918 -0.208152 -0.6624507 0.0788438 0.0458394 0.0766148 -0.0822303 -0.1264488 -0.0120938 0.2234011 -0.225268 -0.1531586 0.2385705 0.074985 0.316158 -0.1883763 -0.4111558 0.1049578 0.1948265 0.2564716 -0.2184326 -0.2431821 0.1381317 -0.3591315 -0.3739509 -0.2648712 0.0145131 -0.0206342 0.0177934 0.0889865 0.0401715 -0.1739303 0.0234941 0.0626454 0.2687754 -0.0129318 -0.0013439 -0.0129989 -0.5023332 -0.0077918 -0.1020538 -0.0158226 -0.002422 0.5341858 0.0437089 -0.1212817 -0.0573983 0.2620991 -0.1162748 0.1355221 -0.09368 0.1941123 0.2227851 -0.292416 -0.1307403 -0.3222578 0.9811362 0.1461858 -0.0769497 0.1317636 -0.0299719 0.2170634 0.3328859 -0.1236062 0.3458165 0.9717587 -0.1137353 -0.0892843 -0.0872414 -0.0391695 -0.1337036 0.1124251 0.0164015 0.1073905 -0.192038 -0.0427095 0.0129032 -0.0422798 -0.1123208 -0.1325313 -0.1251703 0.0154096 -0.1037355 -0.1823243 0.0401161 0.0103968 0.0397275 -0.1078296 0.0203945 0.0053898 -0.0796326 -0.0053959 0.0985767 0.0056837 -0.0618882 0.0040122 -0.1266525 0.0487307 0.0178634 0.0256914 0.0441363 -0.0236601 -0.1313695 0.0243575 -0.0638034 0.0116447 0.0682576 -0.014247 0.0153874 -0.0266072 -0.0024607 0.103593 0.0120299 0.0563609 0.0280896 -0.0946375 -0.0448163 0.0524611 -0.0714029 -0.0913787 0.1605437 0.0982477 0.0939404 -0.0727841 0.0525414 0.0139895 0.0170101 0.0136369 -0.0421323 -0.0859171 0.05228 -0.0613014 0.0074375 0.0510322 -0.0288804 -0.1039099 0.0328685 0.0202249 -0.2486573 -0.0782742 -0.1396586 0.1009877 0.0717279 -0.0471041 0.0289867 -0.0679565 -0.0105966 0.0174986 0.0339 0.0139099 0.1580426 0.0752336 0.0435699 0.0295844 0.0639359 -0.0129312 -0.0234901 0.0335787 -0.0200306 0.1562253 -0.0705192 0.0010052 0.0794353 0.0011675 0.0637329 -0.0023391 0.0821318 -0.0022355 0.1365945 0.0567842 -0.0091269 -0.1638696 0.0442768 0.0463697 0.1800244 -0.2021033 0.1160147 0.1702973 0.0254971 -0.0966698 -0.0643854 -0.0200892 0.2417257 0.1031253 -0.0135095 0.1145856 0.2062167 unknown
polarizability: 147.9966345|0.7993419|139.2128562|-11.6260576|1.2757327|68.6927416 unknown
InChI: InChI=1S/C8H10Cl2N2/c9-7-2-1-3-8(10)6(7)4-5-12-11/h1-3,12H,4-5,11H2
charge 0 multiplicity 1
22 atoms
Cl -0.341183 -2.813966 -0.446315
Cl -0.247399 2.804827 -0.353729
N  3.424863 -0.1810 -0.193724
N  4.427251 -0.059401 0.805548
C  1.050312 -0.02116 -0.854559
C  -0.387717 -0.002323 -0.381335
C  2.046103 -0.090356 0.335395
C  -1.13221 -1.187907 -0.142346
C  -1.091643 1.200419 -0.106655
C  -2.461317 -1.203202 0.319589
C  -2.420349 1.242473 0.35663
C  -3.107365 0.027414 0.568756
H  1.207799 -0.899036 -1.509025
H  1.280472 0.884723 -1.439333
H  1.773498 -0.946551 0.997919
H  1.987728 0.830363 0.939257
H  3.544114 -1.002201 -0.811226
H  -2.977431 -2.153446 0.479672
H  -2.904901 2.203864 0.546366
H  -4.141182 0.039182 0.927571
H  4.678235 -0.893024 1.350133
H  5.200721 0.549307 0.53971
