program: Gaussian 09
title: 000161213
version: EM64L-G09RevD.01
frameworkgroup: C1[X(C5H7O2)]
method: RPBEPBE
basis: SDD
operation: Freq
keyword: #p
keyword: freq=noraman
keyword: PBEPBE/SDD
title: #p freq=noraman PBEPBE/SDD
converged: YES YES NO NO
title: Mulliken charges:
elementType: O O C C C C C H H H H H H H
charge: -0.379462 -0.376068 -0.473741 0.191956 0.162325 -0.765423 -0.787817 0.192257 0.184524 0.225331 0.223129 0.204162 0.194708 0.204120
chargesum: -1.00000
title: Mulliken charges with hydrogens summed into heavy atoms:
elementType: O O C C C C C
charge: -0.379462 -0.376068 -0.281484 0.191956 0.162325 -0.132439 -0.184827
polarizability: 1.00002516e+02 5.33024148e+00 6.78131885e+01 3.56399894e-03 1.91243434e-02 3.92503350e+01
1716.lowfreq: -71.7092 -12.3274 -0.0009 -0.0004 0.0005 5.2912 12.6753 93.2312 104.8164
frequency: -70.8935 93.2280 104.7592 175.4476 193.5158 340.4757 383.0961 502.4878 545.3233 587.4909 617.6421 794.9801 806.8860 919.3046 967.0165 992.0718 1013.2017 1019.7471 1147.3392 1298.7987 1336.8119 1349.4236 1400.8695 1423.1282 1432.3647 1450.3065 1450.4305 1530.9829 1552.5701 2953.0705 2969.4034 3044.4121 3062.8674 3066.1383 3085.6200 3102.8356
redmass: 1.0275 3.9207 1.1416 3.4816 4.2371 3.0055 6.0796 3.6620 2.4923 3.8053 2.5623 1.2441 4.0577 3.4772 1.8372 1.5463 1.7556 1.6639 2.3105 1.9584 1.2224 1.3550 3.2030 1.3634 1.0526 1.0814 1.0909 3.9536 6.1391 1.0326 1.0330 1.0979 1.1006 1.0960 1.1030 1.0882
irintensity: 0.0180 12.0268 0.0084 0.0957 12.3129 0.3511 0.0587 12.3787 0.2188 8.5789 0.0126 38.3952 2.6128 46.1626 26.0894 20.6209 13.8104 11.7847 31.1116 49.2901 34.8672 78.3983 58.2671 74.1908 8.8391 26.0568 31.5369 46.8320 703.6481 64.7011 37.2659 46.3416 42.9474 28.2696 43.4604 46.9622
temp: 298.150 k
press: 1.00000 atm
elementType: 8 8 6 6 6 6 6 1 1 1 1 1 1 1
symmnumber: 1
zpe: 279412.1 jmol-1
zpe.correction: 0.106422 hartree
zpe.thermalcorrener: 0.113777 hartree
zpe.thermalcorrenthalpy: 0.114721 hartree
zpe.thermalcorrgfe: 0.074585 hartree
zpe.sumelectzpe: -344.684989 hartree
zpe.sumelectthermal: -344.677634 hartree
zpe.sumelectthermalent: -344.676690 hartree
zpe.sumelectthermalfe: -344.716827 hartree
dipole: 2.4266 -0.0435 0.0000
dipole: 2.4270
quadrupole: -64.3817 -54.6106 -45.0269
quadrupole: -11.0065 -0.0062 0.0018
quadrupole: -9.7086 0.0624 9.6462 -11.0065 -0.0062 0.0018
hfenergy: -344.7914112 hartree
pointgroup: C01 [X(C5H7O2)]
dipole: -0.9504828 0.0882177 -0.0231234 debye
dipolederiv: -1.4810841 -0.238568 -0.0441304 -0.4557491 -0.7602327 -0.0310646 -0.0564534 -0.0246625 -0.4488996 -0.821289 -0.0849225 -0.0172956 -0.4995103 -1.2179049 -0.0605862 -0.040215 -0.048585 -0.4210251 -1.5653516 -0.2073727 -0.0443839 0.2151512 -0.2259623 0.0206346 -0.0201536 0.0081096 -0.4789145 1.7728596 0.1445179 0.0577551 -0.187503 0.8587002 0.0372191 0.0399056 0.0466567 0.0975441 1.4542266 0.0647212 0.0455568 0.4651122 1.1306066 0.073918 0.0688703 0.0621442 0.0797896 0.117213 0.0204967 0.0017469 0.1138595 -0.5087903 -0.0286106 0.0044375 -0.031049 0.054097 -0.3242893 0.3018481 0.0055356 0.240151 -0.0684273 0.0001052 0.0017914 0.0019713 0.0605061 0.0126189 0.048359 -0.0021866 0.053135 -0.2092166 -0.020774 -0.0021881 -0.0206978 0.1818804 -0.2339845 0.1412883 0.0022665 0.048664 0.0508265 -0.0014994 -0.0028488 0.0004445 0.091071 0.0683228 -0.0452756 -0.0951593 0.0149549 0.043041 -0.054083 -0.0429589 -0.0822078 -0.0741529 0.0595843 -0.0572312 0.0944716 0.0084286 0.0248104 0.0671709 0.0498299 0.0924891 -0.0560674 -0.0684795 -0.0191617 0.1280491 -0.0486566 0.0526482 0.0658838 0.1833145 0.0341776 -0.0733647 0.0588208 -0.0661454 -0.004912 0.0553746 -0.2327459 -0.0173406 0.002218 -0.0210268 0.0903418 -0.0491681 -0.0025541 -0.1273137 -0.0234121 0.062647 -0.0509733 -0.1855494 -0.0177639 -0.1028059 unknown
polarizability: 100.5537588|2.8221539|67.1105131|1.9706421|1.6537195|39.4017673 unknown
InChI: InChI=1S/C5H7O2/c1-4(6)3-5(2)7/h3H,1-2H3
charge -1 multiplicity 1
14 atoms
O  2.358985 0.899743 0.135292
O  -1.454608 -1.293915 -0.102227
C  -0.038976 0.706111 0.054762
C  1.293789 0.157935 0.062006
C  -1.277713 -0.003522 -0.023093
C  1.471169 -1.36874 -0.020518
C  -2.567774 0.860109 -0.012953
H  -0.083893 1.802388 0.115744
H  2.55223 -1.600067 -0.015323
H  0.983654 -1.770153 -0.927618
H  0.957087 -1.867163 0.821767
H  -3.201983 0.554088 0.84237
H  -2.363514 1.944682 0.056981
H  -3.146353 0.658304 -0.935991
