program: Gaussian 09
title: 000161197
version: EM64L-G09RevD.01
frameworkgroup: C1[X(C9H14N2O7)]
method: RPBEPBE
basis: SDD
operation: Freq
keyword: #p
keyword: freq=noraman
keyword: PBEPBE/SDD
title: #p freq=noraman PBEPBE/SDD
converged: YES YES NO NO
title: Mulliken charges:
elementType: O O O O O O O N N C C C C C C C C C H H H H H H H H H H H H H H
charge: -0.260946 -0.398968 -0.416121 -0.228677 -0.234001 -0.415530 -0.215446 -0.401215 -0.597003 -0.402962 -0.544341 -0.103907 -0.151728 0.294065 -0.534811 0.159700 0.172509 0.208105 0.255746 0.225006 0.222245 0.242620 0.320289 0.238576 0.297737 0.293768 0.250728 0.274145 0.301110 0.389239 0.377323 0.382743
chargesum: 0.00000
title: Mulliken charges with hydrogens summed into heavy atoms:
elementType: O O O O O O O N N C C C C C C C C C
charge: -0.260946 -0.009729 -0.038798 -0.228677 -0.234001 -0.032787 -0.215446 -0.103478 -0.021747 0.077791 -0.079476 0.216382 0.086847 0.294065 0.009685 0.159700 0.172509 0.208105
polarizability: 1.54055484e+02 7.88200371e+00 1.26487070e+02 8.42908965e+00 -1.98220989e-02 1.20576612e+02
1716.lowfreq: -4.7284 -0.0005 -0.0003 0.0008 2.3378 5.2652 11.8420 17.7546 28.9743
frequency: 11.5679 17.6155 28.9692 33.5207 36.8372 50.0581 54.7362 65.1266 99.8341 105.6152 136.1688 168.4998 192.9833 230.9167 242.5025 268.8468 290.0785 308.1071 331.5718 349.2480 389.4659 414.7986 479.5261 502.3921 523.2429 544.1564 558.5961 565.8792 589.1829 600.9008 607.6722 615.0917 634.1335 658.4621 686.0436 694.4261 713.2504 769.2552 822.3062 833.3404 878.5156 913.8461 949.7399 983.9175 1029.2789 1031.6333 1050.2640 1054.4397 1070.7524 1091.6276 1119.7175 1134.3117 1151.2432 1176.2805 1187.5879 1220.0010 1256.1922 1257.3441 1264.1788 1269.1414 1296.0707 1313.1442 1319.7970 1327.9178 1355.6332 1367.7352 1398.9165 1440.3326 1441.0548 1466.8527 1475.0995 1613.5547 1624.4479 1647.9968 1672.9240 1675.1761 2977.6648 2981.5399 2994.5055 3008.5615 3009.3808 3038.6973 3067.7332 3074.1233 3472.5281 3501.0003 3512.5747 3512.8694 3550.1115 3609.3168
redmass: 6.0599 8.0032 10.9466 9.2699 7.3220 7.9981 5.3153 5.4587 4.6715 4.7072 3.9617 3.3092 3.8924 5.3584 1.3750 4.0799 2.9817 4.2016 4.4378 2.9209 4.3310 4.3509 3.5696 2.1404 2.8101 2.0440 2.2313 1.7445 2.7359 2.1697 1.4906 2.3527 1.8396 1.5865 2.7673 3.9096 2.7038 2.7807 1.8892 6.5979 2.3223 5.0472 4.3228 2.4355 2.7798 3.0178 2.9794 3.2746 2.2935 2.2067 1.6638 1.6711 1.9576 1.5975 1.4319 1.7021 1.4260 1.4167 1.4237 1.6154 1.2841 1.6648 1.3578 1.4355 1.6196 1.9298 1.7707 1.0895 1.1193 1.0986 1.8146 1.3093 6.4468 9.5903 3.6771 8.6854 1.0808 1.0615 1.0621 1.0819 1.0614 1.0989 1.1038 1.0994 1.0449 1.0638 1.0640 1.0640 1.0778 1.0988
irintensity: 0.3308 0.0676 2.0688 1.2149 2.4259 1.4616 0.9758 4.9037 2.1229 1.2444 7.0800 1.0952 22.1139 1.3900 45.8490 3.5616 4.9703 3.0143 3.1642 2.1623 7.4318 1.3650 11.9766 24.8248 13.8502 92.3880 245.7787 103.9894 59.6417 81.3018 212.1340 13.9865 79.8038 125.3671 42.7327 32.9837 29.8554 12.7515 4.6004 33.5355 6.2601 7.7066 26.0937 8.0311 12.4735 77.0535 202.5110 54.0625 348.7773 40.2824 1.9684 1.3742 11.7676 19.9099 3.7063 96.1925 10.4052 9.1578 40.3692 34.8347 2.0120 43.2348 14.1566 15.5594 46.8095 57.8360 4.3535 12.9241 84.0277 16.6610 191.2769 157.7199 108.1400 272.7383 135.9152 211.2621 34.7931 8.2928 7.0939 34.9513 9.9129 7.0653 30.3955 6.1822 9.1285 20.7001 34.4140 30.0325 15.3145 10.3970
temp: 298.150 k
press: 1.00000 atm
elementType: 8 8 8 8 8 8 8 7 7 6 6 6 6 6 6 6 6 6 1 1 1 1 1 1 1 1 1 1 1 1 1 1
symmnumber: 1
zpe: 634392.8 jmol-1
zpe.correction: 0.241627 hartree
zpe.thermalcorrener: 0.261691 hartree
zpe.thermalcorrenthalpy: 0.262635 hartree
zpe.thermalcorrgfe: 0.187469 hartree
zpe.sumelectzpe: -986.060077 hartree
zpe.sumelectthermal: -986.040013 hartree
zpe.sumelectthermalent: -986.039069 hartree
zpe.sumelectthermalfe: -986.114235 hartree
dipole: -0.9629 -0.2325 -4.4547
dipole: 4.5635
quadrupole: -126.1322 -95.0782 -102.7567
quadrupole: -5.3234 5.0710 2.5911
quadrupole: -18.1431 12.9108 5.2323 -5.3234 5.0710 2.5911
hfenergy: -986.3017045 hartree
pointgroup: C01 [X(C9H14N2O7)]
dipole: -0.4023792 -0.6864825 1.6094553 debye
polarizability: 154.5761561|-3.0787807|125.2936139|-10.385086|2.0965081|121.249396 unknown
InChI: InChI=1S/C9H14N2O7/c10-4(8(15)16)1-2-6(12)11-5(9(17)18)3-7(13)14/h4-5,11,13,15,17H,1-3,10H2
charge 0 multiplicity 1
32 atoms
O  -0.260984 1.52625 -1.154521
O  -2.369655 2.266551 1.706214
O  3.904213 -0.233502 2.123436
O  -4.469601 1.657232 0.929236
O  4.853935 -1.519549 0.441826
O  -3.163034 -3.185228 -0.587967
O  -2.493107 -1.530702 -2.076226
N  -1.110135 0.184473 0.541237
N  4.868502 0.739652 -1.208859
C  2.40486 0.474376 -0.626982
C  1.326648 0.583855 0.474588
C  -2.497903 0.393206 0.139966
C  3.877103 0.680221 -0.127431
C  -0.062063 0.811855 -0.128331
C  -3.326278 -0.910368 0.1689
C  -3.232405 1.475607 0.950326
C  4.28109 -0.465177 0.794507
C  -2.934019 -1.851738 -0.953943
H  2.199309 1.261997 -1.37637
H  2.331516 -0.497529 -1.151691
H  1.332242 -0.302176 1.135705
H  1.555471 1.456886 1.119457
H  -2.4504 0.77037 -0.904188
H  3.905315 1.614302 0.465325
H  -0.918051 -0.299436 1.420052
H  -4.394857 -0.650242 0.04198
H  -3.239972 -1.434972 1.136493
H  4.625671 1.376405 -1.97113
H  5.195916 -0.179484 -1.521644
H  -2.894074 2.985939 2.153038
H  4.176436 -1.014247 2.679688
H  -2.947791 -3.779626 -1.357788
