program: Gaussian 09
title: 000161166
version: EM64L-G09RevD.01
frameworkgroup: C1[X(C10H12N2O3)]
method: RPBEPBE
basis: SDD
operation: Freq
keyword: #p
keyword: freq=noraman
keyword: PBEPBE/SDD
title: #p freq=noraman PBEPBE/SDD
converged: YES YES NO NO
title: Mulliken charges:
elementType: O O O N N C C C C C C C C C C H H H H H H H H H H H H
charge: -0.311163 -0.415955 -0.250951 -0.567824 -0.674559 -0.546334 -0.211050 0.198712 0.150890 0.315334 -0.314171 0.201100 -0.408074 -0.299681 -0.193928 0.247996 0.265831 0.275238 0.244714 0.273517 0.291003 0.220289 0.229581 0.226827 0.300395 0.380802 0.371461
chargesum: 0.00000
title: Mulliken charges with hydrogens summed into heavy atoms:
elementType: O O O N N C C C C C C C C C C
charge: -0.311163 -0.044493 -0.250951 -0.003304 0.006637 -0.032507 0.064188 0.198712 0.150890 0.315334 -0.069456 0.201100 -0.187785 -0.070101 0.032899
polarizability: 1.83611452e+02 5.77511146e+00 1.46328052e+02 -1.29888551e+01 -5.25033824e+00 7.91269538e+01
1716.lowfreq: -13.4240 -9.0750 -1.8611 0.0005 0.0007 0.0009 28.9885 40.7982 56.9720
frequency: 28.7730 40.7947 56.9587 90.0248 116.9560 142.7171 187.1672 230.9479 253.8041 256.1963 284.5429 320.9838 369.0803 414.1022 416.6271 448.0541 487.1265 512.5276 514.6188 554.1148 561.4550 594.4912 614.8659 646.1021 653.4827 706.4321 732.8785 755.1963 760.6449 796.6232 812.1929 838.9943 850.3684 941.6509 957.4367 978.3370 983.6535 1021.2194 1027.8693 1054.6064 1064.0848 1104.2151 1142.4268 1159.5346 1177.7301 1210.5133 1242.5881 1266.3138 1286.8783 1333.2427 1337.0500 1354.4856 1367.6621 1406.4472 1422.3869 1440.5649 1477.2544 1524.0334 1571.3651 1595.2665 1631.3791 1641.0991 1653.6218 2987.8175 3052.4813 3082.3734 3119.7446 3139.4682 3148.9906 3170.6566 3333.5910 3448.2532 3506.7574 3579.5555 3631.1794
redmass: 6.3276 5.2892 8.3168 6.1519 4.0696 6.2128 3.6919 4.1143 3.1138 3.5852 3.0833 1.3211 6.6023 5.1196 3.3991 3.4839 1.1972 3.5026 2.6924 6.2282 2.4418 1.4029 2.8389 1.5772 4.8263 4.8519 2.2614 1.5626 3.1863 3.5185 1.3087 4.8937 1.5590 1.4973 2.3392 1.4352 2.4622 2.8264 2.3534 2.0114 1.7531 2.5829 1.3004 1.3187 1.0601 1.4739 1.6623 1.9444 1.7234 1.7192 2.4054 1.5486 1.8260 3.8734 1.5560 2.0045 2.2968 4.3572 5.4211 1.4931 6.3042 1.1131 7.2710 1.0617 1.0963 1.0872 1.0868 1.0887 1.0933 1.0999 1.0595 1.0448 1.0639 1.0980 1.0918
irintensity: 1.3808 1.1446 2.2836 0.9515 0.5508 0.2480 0.2183 4.3700 8.0724 7.3402 9.0025 54.7743 11.8615 1.3749 5.7356 2.4153 122.7520 57.7207 4.4378 1.2682 18.0955 174.2035 26.7461 180.6313 31.7516 35.7723 54.5607 67.2484 39.9089 20.5815 65.4915 2.1983 1.9112 6.7827 15.7273 1.6539 18.3491 58.8118 74.6047 218.7880 4.6789 17.8877 3.6267 15.2654 20.0098 10.3934 46.4510 62.3146 26.8613 66.2113 36.1726 8.9447 34.6509 25.2472 30.6019 24.3471 62.2961 200.4942 28.7952 209.9010 180.1193 48.7329 183.0093 10.6453 3.1735 9.3978 8.3596 7.6321 28.0324 19.4179 115.6594 2.7770 20.0248 3.5966 52.8782
temp: 298.150 k
press: 1.00000 atm
elementType: 8 8 8 7 7 6 6 6 6 6 6 6 6 6 6 1 1 1 1 1 1 1 1 1 1 1 1
symmnumber: 1
zpe: 554024.3 jmol-1
zpe.correction: 0.211017 hartree
zpe.thermalcorrener: 0.225412 hartree
zpe.thermalcorrenthalpy: 0.226356 hartree
zpe.thermalcorrgfe: 0.168726 hartree
zpe.sumelectzpe: -722.350006 hartree
zpe.sumelectthermal: -722.335611 hartree
zpe.sumelectthermalent: -722.334667 hartree
zpe.sumelectthermalfe: -722.392296 hartree
dipole: -1.0117 -0.0687 -0.3128
dipole: 1.0612
quadrupole: -66.5843 -76.2199 -96.9553
quadrupole: -4.9827 -0.0514 -1.3484
quadrupole: 13.3356 3.6999 -17.0355 -4.9827 -0.0514 -1.3484
hfenergy: -722.5610228 hartree
pointgroup: C01 [X(C10H12N2O3)]
dipole: 0.3955428 0.0281896 -0.1306762 debye
polarizability: 184.2846554|4.8666943|145.5411936|10.9723171|8.2187365|79.2406083 unknown
InChI: InChI=1S/C10H12N2O3/c11-7-4-2-1-3-6(7)9(13)5-8(12)10(14)15/h1-4,8,14H,5,11-12H2
charge 0 multiplicity 1
27 atoms
O  -0.653094 -1.335376 -0.504341
O  -4.094344 -1.249654 0.139063
O  -2.814721 -0.371089 1.868925
N  -3.478301 1.778199 -0.489278
N  1.788928 -2.306027 -0.418656
C  -1.160661 1.004378 -0.137615
C  -2.609564 0.581309 -0.425954
C  -0.179337 -0.165668 -0.24564
C  1.260382 0.069806 -0.055377
C  2.209493 -1.02396 -0.147344
C  1.757816 1.379092 0.229643
C  -3.115127 -0.388564 0.652996
C  3.601458 -0.747386 0.049809
C  3.122257 1.631718 0.419574
C  4.044958 0.550871 0.326594
H  -1.09768 1.437668 0.880991
H  -0.895167 1.804525 -0.852708
H  -2.66187 0.058808 -1.393933
H  1.049762 2.210517 0.303623
H  -3.512904 2.311571 0.38693
H  -4.41266 1.589534 -0.866233
H  4.319348 -1.573819 -0.019219
H  3.476419 2.643789 0.637388
H  5.115608 0.734444 0.473402
H  2.459999 -3.068765 -0.472616
H  0.775521 -2.449116 -0.545706
H  -4.439517 -1.827704 0.872781
