program: Gaussian 09
title: 000161144
version: EM64L-G09RevD.01
frameworkgroup: C1[X(H3P)]
method: RPBEPBE
basis: SDD
operation: Freq
keyword: #p
keyword: freq=noraman
keyword: PBEPBE/SDD
title: #p freq=noraman PBEPBE/SDD
converged: YES YES YES YES
title: Mulliken charges:
elementType: P H H H
charge: -0.102398 0.034137 0.034131 0.034130
chargesum: 0.00000
title: Mulliken charges with hydrogens summed into heavy atoms:
elementType: P
charge: 0.000000
polarizability: 2.22418637e+01 -5.96980722e-06 2.22397894e+01 -4.09935114e-04 -6.91520318e-05 1.77021698e+01
1716.lowfreq: -0.0007 0.0030 0.0034 16.6249 39.8449 55.2164 995.1188 1125.6049 1125.8100
frequency: 995.1163 1125.6046 1125.8093 2204.0965 2235.2367 2235.7078
redmass: 1.0788 1.0260 1.0261 1.0286 1.0403 1.0404
irintensity: 29.2815 13.3320 13.3940 65.0531 96.7779 96.8274
temp: 298.150 k
press: 1.00000 atm
elementType: 15 1 1 1
symmnumber: 1
zpe: 59344.2 jmol-1
zpe.correction: 0.022603 hartree
zpe.thermalcorrener: 0.025519 hartree
zpe.thermalcorrenthalpy: 0.026463 hartree
zpe.thermalcorrgfe: 0.001492 hartree
zpe.sumelectzpe: -342.896358 hartree
zpe.sumelectthermal: -342.893442 hartree
zpe.sumelectthermalent: -342.892498 hartree
zpe.sumelectthermalfe: -342.917469 hartree
dipole: -0.0001 0.0002 1.3901
dipole: 1.3901
quadrupole: -14.8561 -14.8565 -17.2622
quadrupole: 0.0000 0.0003 -0.0004
quadrupole: 0.8021 0.8017 -1.6039 0.0000 0.0003 -0.0004
hfenergy: -342.9189612 hartree
pointgroup: C01 [X(H3P1)]
dipole: 0.2506072 0.0129415 0.4859379 debye
dipolederiv: 0.2904903 0.0022575 0.0869904 0.00228 0.2458258 0.0044703 0.0870139 0.0044629 0.4144165 0.0020943 -0.0120124 -0.0043525 0.0256171 -0.0486167 -0.054203 0.1600605 -0.1187202 -0.270413 -0.2232984 -0.1194253 -0.0269506 -0.0742826 -0.06869 -0.0178247 -0.1737641 -0.1128891 -0.0248529 -0.0692862 0.1291802 -0.0556873 0.0463855 -0.1285192 0.0675574 -0.0733103 0.2271463 -0.1191506 unknown
polarizability: 21.2891562|-0.0498609|22.23728|-1.8478779|-0.0959151|18.6573867 unknown
InChI: InChI=1S/H3P/h1H3
charge 0 multiplicity 1
4 atoms
P  -0.012964 -0.000623 -0.025066
H  -0.648576 0.523657 1.17598
H  1.225609 0.730756 0.203837
H  0.46783 -1.20059 0.64605
