program: Gaussian 09
title: 000161129
version: EM64L-G09RevD.01
frameworkgroup: C1[X(N2O3)]
method: RPBEPBE
basis: SDD
operation: Freq
keyword: #p
keyword: freq=noraman
keyword: PBEPBE/SDD
title: #p freq=noraman PBEPBE/SDD
converged: NO NO NO NO
title: Mulliken charges:
elementType: O O O N N
charge: -0.144937 -0.137434 0.005964 0.112002 0.164404
chargesum: 0.00000
title: Mulliken charges with hydrogens summed into heavy atoms:
polarizability: 4.95217271e+01 1.93765542e+00 3.27655706e+01 4.72321767e-05 -3.22725649e-03 1.02598246e+01
1716.lowfreq: -18.5725 -13.2260 -4.5382 -0.0006 0.0008 0.0009 120.4825 181.6689 279.6675
frequency: 120.4100 181.6471 279.6673 404.7847 579.0994 719.5116 1203.3056 1501.1381 1650.4444
redmass: 14.9831 15.7668 15.1530 14.3649 14.7411 15.1645 15.1342 14.5956 14.8644
irintensity: 0.3556 0.1769 10.0050 2.6020 12.9085 39.7736 207.0403 205.4385 270.3035
temp: 298.150 k
press: 1.00000 atm
elementType: 8 8 8 7 7
symmnumber: 1
zpe: 39716.1 jmol-1
zpe.correction: 0.015127 hartree
zpe.thermalcorrener: 0.020298 hartree
zpe.thermalcorrenthalpy: 0.021242 hartree
zpe.thermalcorrgfe: -0.013413 hartree
zpe.sumelectzpe: -334.615701 hartree
zpe.sumelectthermal: -334.610530 hartree
zpe.sumelectthermalent: -334.609586 hartree
zpe.sumelectthermalfe: -334.644240 hartree
dipole: 1.7735 -0.5765 0.0008
dipole: 1.8649
quadrupole: -28.2780 -30.3740 -24.3564
quadrupole: -1.4325 -0.0004 0.0036
quadrupole: -0.6085 -2.7045 3.3131 -1.4325 -0.0004 0.0036
hfenergy: -334.6308276 hartree
pointgroup: C01 [X(N2O3)]
dipole: 0.6836171 -0.2664083 0.0003013 debye
dipolederiv: -0.5682415 0.0822393 -0.0003373 0.3134337 -0.9497749 -0.0005077 -0.0002912 -0.0002932 -0.1361738 -1.0466554 -0.2284069 -0.0006284 -0.1493217 -0.5382906 -0.000461 -0.0008438 -0.0004587 -0.1336086 -1.0203411 0.1224476 0.0003742 -1.0518305 0.1385354 0.0009102 0.004766 -0.0003784 0.0416081 1.4020626 0.1475658 0.0013008 -0.0761848 1.3822881 0.0012648 0.0009016 0.0008791 0.1492478 1.2331754 -0.1238458 -0.0007094 0.9639033 -0.0327579 -0.0012063 -0.0045326 0.0002512 0.0789265 unknown
polarizability: 49.6884192|0.9662315|32.5988785|-0.0001378|-0.0032247|10.2598246 unknown
InChI: InChI=1S/NO2.NO/c2-1-3;1-2
charge 0 multiplicity 1
5 atoms
O  -0.572074 1.342037 0.000785
O  -1.673963 -0.678636 -0.001129
O  1.875673 0.059624 -0.001845
N  -0.668444 0.08056 0.000275
N  1.038708 -0.803584 0.001916
