program: Gaussian 09
title: 000161126
version: EM64L-G09RevD.01
frameworkgroup: C1[X(C10H15NO2)]
method: RPBEPBE
basis: SDD
operation: Freq
keyword: #p
keyword: freq=noraman
keyword: PBEPBE/SDD
title: #p freq=noraman PBEPBE/SDD
converged: YES YES NO NO
title: Mulliken charges:
elementType: O O N C C C C C C C C C C H H H H H H H H H H H H H H H
charge: -0.492815 -0.434275 -0.313663 -0.027529 -0.613493 0.573446 -0.710625 -0.573251 -0.405412 -0.639108 0.176113 -0.323912 0.132940 0.199515 0.227976 0.195523 0.219472 0.216236 0.232496 0.253272 0.232658 0.232564 0.217953 0.231820 0.190337 0.248462 0.371444 0.381856
chargesum: 0.00000
title: Mulliken charges with hydrogens summed into heavy atoms:
elementType: O O N C C C C C C C C C C
charge: -0.121371 -0.052419 -0.060391 0.171986 -0.189994 0.573446 -0.042421 -0.340593 -0.172848 0.001003 0.176113 -0.075450 0.132940
polarizability: 1.69594417e+02 5.02033171e+00 1.19734155e+02 1.21620171e+01 -4.80603702e+00 8.14153828e+01
1716.lowfreq: -7.6608 -6.2645 -0.0001 0.0002 0.0008 6.1598 27.7796 47.8218 61.2423
frequency: 27.0672 47.7817 61.2309 92.5149 160.4254 194.2244 221.0474 225.5101 243.8775 269.8742 277.8733 291.3705 330.7737 338.7487 431.4273 438.0739 449.4651 457.5257 482.4765 536.9291 571.0542 610.6086 658.5565 712.2094 741.1895 768.5191 806.5862 826.6051 855.2751 884.0861 913.5600 935.2691 943.0128 1037.7628 1058.7548 1071.3911 1088.0809 1105.6499 1130.2160 1160.4300 1169.8985 1184.7110 1184.8720 1216.5364 1230.2124 1277.3045 1287.1230 1325.2001 1340.9157 1344.6667 1375.6762 1408.0900 1430.7042 1434.4750 1456.1859 1462.4395 1469.3766 1474.0018 1483.7791 1496.1703 1520.2896 1615.4429 1625.5089 2833.0561 2869.6908 2958.4788 2982.5699 3022.7951 3037.2694 3074.9788 3080.7737 3088.3827 3110.4593 3129.9393 3169.4478 3434.0813 3529.7547 3622.5191
redmass: 3.3492 3.2424 4.4036 2.1535 4.9445 1.0333 2.3156 2.3571 3.5309 1.1659 3.2011 2.3205 2.4670 5.1025 2.9636 2.5399 2.7116 2.8544 1.1174 4.4707 6.4970 3.4530 1.5857 3.9173 4.6393 4.6537 1.6975 1.5872 1.8418 1.4573 2.2585 1.3672 2.4632 1.8495 1.6435 2.1963 2.0114 1.3098 1.3367 1.4150 2.6565 1.4404 1.8010 1.5259 2.4020 1.4744 1.6086 1.4396 1.4046 1.8191 1.2240 4.0207 3.7079 1.1703 1.1605 1.0571 1.1210 1.1086 1.0514 1.0482 3.2686 6.4958 7.2023 1.0812 1.0565 1.0642 1.0355 1.0738 1.0966 1.1001 1.0993 1.0993 1.0914 1.0895 1.0952 1.0743 1.0649 1.0666
irintensity: 1.9672 1.1049 0.5468 1.9888 0.1666 0.4057 1.8809 1.3002 4.2456 165.7170 7.3094 5.0463 1.3775 2.7342 9.0019 2.3614 38.5680 24.3125 111.5503 4.6192 23.9415 45.1593 55.9792 1.7626 15.0137 15.1123 37.3881 0.9052 29.1737 4.8229 2.2045 0.6237 14.1838 6.7163 3.4529 141.6191 30.7200 2.9518 12.2376 17.9787 41.5016 193.9358 10.0365 37.0788 92.1700 31.3981 52.6401 7.9485 16.2042 31.5553 22.0174 24.1755 43.5712 5.8730 19.3970 7.0139 3.7586 2.5384 10.9202 24.1753 96.5750 21.4227 11.0308 80.2183 143.0006 47.1561 17.7893 51.8960 21.7988 41.5071 37.5671 29.9762 14.8973 12.4998 6.6039 2.7433 81.9772 47.2411
temp: 298.150 k
press: 1.00000 atm
elementType: 8 8 7 6 6 6 6 6 6 6 6 6 6 1 1 1 1 1 1 1 1 1 1 1 1 1 1 1
symmnumber: 1
zpe: 611380.3 jmol-1
zpe.correction: 0.232862 hartree
zpe.thermalcorrener: 0.246886 hartree
zpe.thermalcorrenthalpy: 0.247830 hartree
zpe.thermalcorrgfe: 0.191624 hartree
zpe.sumelectzpe: -594.241543 hartree
zpe.sumelectthermal: -594.227520 hartree
zpe.sumelectthermalent: -594.226576 hartree
zpe.sumelectthermalfe: -594.282781 hartree
dipole: -1.4542 1.5262 -0.5975
dipole: 2.1911
quadrupole: -81.1125 -70.2057 -81.1233
quadrupole: 13.4768 -2.0016 0.0467
quadrupole: -3.6320 7.2748 -3.6428 13.4768 -2.0016 0.0467
hfenergy: -594.4744057 hartree
pointgroup: C01 [X(C10H15N1O2)]
dipole: 0.5959561 -0.5269817 -0.3320845 debye
polarizability: 169.5833368|8.5735924|117.0108091|-9.3841819|11.5122725|84.149809 unknown
InChI: InChI=1S/C10H15NO2/c1-7(11-2)5-8-3-4-9(12)10(13)6-8/h3-4,6-7,11-13H,5H2,1-2H3
charge 0 multiplicity 1
28 atoms
O  -3.132682 -1.834879 -0.448177
O  -4.047787 0.435853 0.698872
N  3.847283 0.178885 -0.331903
C  2.474198 0.050145 0.21802
C  1.475002 0.198934 -0.967693
C  0.016448 0.260801 -0.543162
C  2.299709 -1.299937 0.942306
C  -0.843953 -0.853496 -0.728081
C  -0.516109 1.428621 0.062124
C  4.940401 0.245383 0.657034
C  -2.186563 -0.788695 -0.312813
C  -1.864834 1.493942 0.478471
C  -2.708752 0.382825 0.294063
H  2.251732 0.866263 0.955099
H  1.65044 -0.643891 -1.66264
H  1.73556 1.127608 -1.518683
H  2.956004 -1.374788 1.827534
H  2.551049 -2.128575 0.25473
H  1.25758 -1.419123 1.286695
H  3.897919 0.96141 -0.998856
H  -0.45615 -1.767179 -1.198428
H  0.129021 2.303651 0.203654
H  5.888221 0.473539 0.137582
H  5.068832 -0.731664 1.155578
H  4.788203 1.013657 1.455499
H  -2.278474 2.394796 0.941396
H  -2.740528 -2.631877 -0.877622
H  -4.47817 -0.433409 0.4847
