program: Gaussian 09
title: 000161096
version: EM64L-G09RevD.01
frameworkgroup: C1[X(C8H11N5O)]
method: RPBEPBE
basis: SDD
operation: Freq
keyword: #p
keyword: freq=noraman
keyword: PBEPBE/SDD
title: #p freq=noraman PBEPBE/SDD
converged: YES YES NO NO
title: Mulliken charges:
elementType: O N N N N N C C C C C C C C H H H H H H H H H H H
charge: -0.214127 -0.070716 -0.074244 -0.062323 -0.110326 -0.033982 -0.401762 -0.396708 -0.400638 -0.400572 -0.048175 -0.011356 0.061619 -0.504419 0.242252 0.246232 0.250470 0.243261 0.243167 0.249671 0.244530 0.242735 0.239516 0.234554 0.231341
chargesum: 0.00000
title: Mulliken charges with hydrogens summed into heavy atoms:
elementType: O N N N N N C C C C C C C C
charge: -0.214127 -0.070716 -0.074244 -0.062323 -0.110326 -0.033982 0.086722 0.097023 0.092200 0.086693 -0.048175 -0.011356 0.061619 0.200993
polarizability: 1.77708696e+02 -1.10971227e+00 1.51414844e+02 -5.56798553e+00 -2.30894923e+00 7.12681120e+01
1716.lowfreq: -9.7570 -0.0008 -0.0007 0.0002 2.6193 7.4832 68.2680 75.0812 80.8746
frequency: 68.2552 75.0661 80.8560 103.0401 129.4729 136.4342 156.4633 162.9485 212.6760 225.8067 242.0079 264.5689 390.4070 412.2280 456.5797 490.0613 551.0825 660.7230 694.7443 699.3070 758.5316 787.7794 791.0478 792.8041 828.3593 886.7546 915.7345 936.1425 941.2465 989.5981 996.6277 1009.2317 1047.6155 1097.1810 1099.4069 1104.8649 1105.8641 1112.3032 1119.1124 1122.3019 1135.0911 1136.4867 1150.1187 1219.6283 1225.6748 1251.3580 1316.3363 1413.8886 1443.9419 1449.2398 1455.8234 1464.0765 1464.1166 1466.0271 1481.2406 1485.6568 1490.7599 1554.8704 3002.5791 3077.6415 3078.3572 3085.2236 3086.3113 3105.1161 3142.3536 3180.9387 3181.4801 3196.7056 3197.2657
redmass: 3.2526 2.9311 3.7121 3.2944 3.6827 1.2446 2.7421 2.6753 5.5802 5.6254 3.4771 5.2251 4.6550 4.8191 6.1130 6.8273 7.4818 6.4405 10.3620 11.3280 6.1343 1.4758 1.3670 1.6623 5.4370 11.9089 5.7685 5.7375 5.1747 1.7527 1.1781 1.5302 3.7284 1.3202 1.3244 1.3306 1.3324 1.2540 1.5044 1.5170 1.4625 1.4761 1.5376 5.4626 5.4089 7.6043 4.9792 2.6618 2.7240 1.0668 1.5940 1.0753 1.0760 1.3033 1.2323 1.9695 3.6462 10.5206 1.0291 1.0483 1.0484 1.0604 1.0603 1.1043 1.1049 1.1189 1.1190 1.1176 1.1176
irintensity: 5.5380 1.9734 16.0425 2.1474 4.1288 0.1464 0.9909 2.6527 6.6937 4.3278 6.9467 37.1919 11.0590 4.4055 3.8577 8.5946 1.3254 2.8587 3.8816 3.7086 31.7539 54.8969 12.6497 8.1051 1.5090 0.6421 1.6857 1.0655 2.3675 30.4756 15.6798 12.5344 87.3203 2.0433 3.8165 3.9544 5.9797 0.2436 47.4184 49.5585 0.9567 0.4272 26.7552 6.7659 21.5817 16.9993 350.3230 213.8683 28.0883 30.0642 478.5275 3.4597 4.2843 76.9876 51.7129 437.3901 1329.8171 151.1924 45.6596 15.3104 18.7582 62.2725 32.1387 28.7130 25.4812 1.2429 1.3305 28.5358 28.8234
temp: 298.150 k
press: 1.00000 atm
elementType: 8 7 7 7 7 7 6 6 6 6 6 6 6 6 1 1 1 1 1 1 1 1 1 1 1
symmnumber: 1
zpe: 505981.8 jmol-1
zpe.correction: 0.192718 hartree
zpe.thermalcorrener: 0.206009 hartree
zpe.thermalcorrenthalpy: 0.206953 hartree
zpe.thermalcorrgfe: 0.152235 hartree
zpe.sumelectzpe: -659.280102 hartree
zpe.sumelectthermal: -659.266812 hartree
zpe.sumelectthermalent: -659.265868 hartree
zpe.sumelectthermalfe: -659.320586 hartree
dipole: -1.3378 -2.0562 0.3188
dipole: 2.4737
quadrupole: -62.1394 -77.7350 -82.0793
quadrupole: -3.7078 4.8229 2.4692
quadrupole: 11.8452 -3.7504 -8.0947 -3.7078 4.8229 2.4692
hfenergy: -659.4728206 hartree
pointgroup: C01 [X(C8H11N5O1)]
dipole: -0.2495056 -0.9405873 -0.0143105 debye
dipolederiv: -1.7465776 -0.239825 0.0051371 -0.4497603 -0.4680156 0.0132165 0.0119197 -0.0078604 -0.3266537 -1.4601561 1.0455606 -0.1919427 0.9296033 -0.8041824 0.1633358 0.287781 -0.2008512 -0.4530969 -0.1018549 -0.1189686 0.0238835 -0.0653601 -2.0953522 0.2525763 0.0167613 -0.3337402 -0.4555842 -0.8040938 0.5630749 -0.0640517 0.4886191 -1.6567468 0.1337919 0.0060151 -0.0070076 -0.1987626 -0.9668914 -0.4445045 0.0133871 -0.4339119 -1.3658373 0.0862391 0.0115772 -0.0134542 -0.1828005 -1.7508438 0.2974021 -0.0671714 0.1243764 -0.6415153 0.0432257 0.0067241 -0.0140673 -0.210602 0.4702828 -0.1879587 -0.0007322 -0.1278523 0.0663709 -0.0182959 -0.0402983 0.0131588 0.2574864 0.2061814 -0.2258419 -0.000082 -0.2428324 0.331854 0.004022 -0.0415243 0.0200358 0.2553397 0.0731345 0.1766883 0.0052619 0.1280739 0.434228 -0.0012108 0.0024819 0.0434227 0.2532482 0.0425344 -0.1218755 -0.0122349 -0.1040701 0.485503 -0.0046463 -0.0005985 0.0456724 0.2558092 1.9927997 -0.8107841 0.0915201 -0.699284 1.5747232 -0.0928566 -0.2495827 0.2058932 0.135535 0.983196 -0.050156 0.0074505 0.0370365 2.4874141 -0.1332505 -0.0129028 0.3061432 0.1436321 2.1885078 0.1330374 0.0119646 0.4815605 1.2873373 -0.0468255 -0.0260661 0.0350701 0.22287 0.8254007 0.03572 -0.0067346 -0.2090382 0.2186822 -0.0006497 -0.0053296 -0.0057063 0.2649747 -0.1192623 0.0111598 0.0376965 -0.0762338 0.1182192 -0.0217216 0.0876525 -0.0149267 0.0427536 0.0109824 0.0178803 0.0247062 -0.0019311 0.0422503 -0.1077842 -0.0956568 -0.0348009 -0.0412314 0.0338231 -0.0042665 0.1084166 0.0224538 0.017317 0.0165587 0.0081623 0.1055767 -0.0231873 0.1057295 0.0138327 0.0384958 0.0887629 -0.1080103 -0.034163 0.0522957 -0.0842489 0.040909 -0.0028055 -0.1561354 -0.0087805 -0.0769412 0.0062202 -0.0480547 -0.0440813 -0.0853571 0.0423077 0.0303023 -0.0251783 0.0698221 0.003549 0.0237594 -0.0869374 0.0856998 0.044153 -0.0267883 0.0368433 0.0209898 -0.0832715 0.0001372 0.0124435 -0.0768614 -0.0890088 0.0598926 -0.0391804 0.0220272 0.1588186 -0.0002321 0.0811504 -0.0289743 -0.0444667 0.0309546 -0.083918 0.04327 0.0145904 -0.0034426 -0.0279318 0.1234219 0.0319098 -0.1001739 0.0178415 -0.0890116 -0.0549315 0.009685 0.0015711 0.0199382 0.1311219 0.0344266 0.0981812 -0.0281356 0.0904725 -0.0678146 -0.0935353 -0.0867985 0.0054851 -0.1526514 -0.0040245 0.0067512 0.0073181 0.0054593 0.1224978 unknown
polarizability: 164.1356595|-13.0647445|164.7554869|3.4852032|-7.0083479|71.5005055 unknown
InChI: InChI=1S/C8H11N5O/c1-14-8-10-6(12-2-3-12)9-7(11-8)13-4-5-13/h2-5H2,1H3
charge 0 multiplicity 1
25 atoms
O  2.446283 1.324321 -0.008559
N  -2.190529 1.628927 0.149213
N  -0.149671 -2.598716 -0.152122
N  -1.223372 -0.510379 -0.004201
N  1.211272 -0.682076 0.002997
N  0.153037 1.513881 -0.002931
C  -3.420967 1.581709 -0.663247
C  -2.542429 2.848404 -0.600309
C  -1.007257 -3.517035 0.619727
C  0.530339 -3.631753 0.653595
C  -1.051228 0.85395 0.022462
C  -0.055973 -1.222308 -0.026569
C  1.229885 0.680939 -0.000436
C  3.65307 0.468784 -0.033105
H  -4.362542 1.544977 -0.106706
H  -3.393871 0.981482 -1.58053
H  -1.926485 3.094757 -1.473072
H  -2.865344 3.703713 0.001102
H  -1.591738 -4.233078 0.033899
H  -1.513287 -3.10763 1.502037
H  1.049238 -3.301077 1.561241
H  1.028969 -4.427896 0.092213
H  3.647225 -0.186878 -0.919728
H  3.703846 -0.155801 0.874531
H  4.486926 1.184482 -0.069903
