program: Gaussian 09
title: 000161086
version: EM64L-G09RevD.01
frameworkgroup: C1[X(C6H15N2O5P)]
method: RPBEPBE
basis: SDD
operation: Freq
keyword: #p
keyword: freq=noraman
keyword: PBEPBE/SDD
title: #p freq=noraman PBEPBE/SDD
converged: YES YES NO NO
title: Mulliken charges:
elementType: P O O O O O N N C C C C C C H H H H H H H H H H H H H H H
charge: 1.349201 -0.415264 -0.654137 -0.687396 -0.232852 -0.603911 -0.791548 -0.564289 -0.392037 -0.368945 -0.353785 -0.225946 -0.281359 0.139056 0.214814 0.206450 0.226914 0.185458 0.213739 0.230442 0.260964 0.230712 0.224976 0.368439 0.284625 0.278620 0.377074 0.385491 0.394492
chargesum: 0.00000
title: Mulliken charges with hydrogens summed into heavy atoms:
elementType: P O O O O O N N C C C C C C
charge: 1.349201 -0.038190 -0.268646 -0.292904 -0.232852 -0.603911 -0.423109 -0.001043 0.029227 0.043426 0.090396 0.035019 0.174329 0.139056
polarizability: 1.39275901e+02 5.27200077e+00 1.08096755e+02 -8.41906009e-01 3.81204630e+00 1.06407563e+02
1716.lowfreq: -14.3823 -6.1863 -0.0020 -0.0014 -0.0011 3.8775 8.7605 20.7121 33.4595
frequency: -2.2985 20.5278 33.4336 43.4115 47.7271 74.8426 106.3498 117.9761 138.8230 161.0645 184.7564 199.6048 228.2849 244.2710 273.2599 311.1110 332.3057 341.3673 354.3260 374.2628 406.7210 416.5978 446.3904 484.0109 509.3986 581.5252 628.4093 661.7765 678.1351 723.1296 734.1072 742.5041 759.7805 791.7894 838.2391 898.9932 943.7456 990.5861 1009.7317 1017.2002 1028.8108 1046.9385 1069.6746 1093.7705 1106.6799 1132.9459 1151.8978 1164.1874 1192.1520 1224.8227 1252.9312 1266.5318 1282.0882 1294.9257 1307.2135 1321.7809 1357.7605 1365.0742 1367.1535 1407.2193 1448.5757 1465.0410 1475.8191 1488.4403 1653.3320 1654.9536 2961.2100 2964.4614 2970.6861 2994.6030 3014.5954 3028.6394 3036.3892 3051.6836 3066.7839 3458.7043 3499.9746 3571.3321 3577.0988 3581.5435 3611.2148
redmass: 6.4550 6.5452 7.3384 4.0420 7.7469 2.2258 3.5456 2.9352 3.0223 4.2170 1.2219 1.8768 3.9268 4.4826 2.7196 2.4014 2.4149 3.6546 2.2055 4.8646 1.4229 2.5983 3.7072 2.2058 2.5859 2.2693 1.6414 10.4745 1.6388 2.3084 1.4819 8.6343 1.6794 1.9481 3.7227 2.0803 1.8166 2.0566 1.1784 2.6950 2.5634 3.4633 2.3863 2.1432 1.7952 3.2256 1.8232 1.5367 1.7336 1.4210 1.4033 1.2893 1.5252 1.0938 1.1681 1.3107 1.3378 1.4749 1.4911 1.3445 1.0838 1.0699 1.0901 1.0878 2.0993 1.8009 1.0621 1.0626 1.0629 1.0601 1.0942 1.0979 1.0848 1.1036 1.1040 1.0454 1.0641 1.0761 1.0965 1.0657 1.0663
irintensity: 0.2189 0.5936 1.8068 0.3659 0.1017 0.4339 0.6344 2.1415 1.0948 0.3749 75.0535 8.3737 1.8313 11.1958 8.6850 14.9309 153.4386 36.5155 30.1524 66.0033 113.7155 71.6712 15.2196 43.8239 29.5562 54.4592 86.8178 132.8708 247.3291 5.4456 29.5169 260.9023 11.0025 27.8092 121.7308 2.6179 17.7474 1.8491 46.6719 27.8208 214.0479 7.3085 6.7367 101.6551 15.7727 203.3278 16.5669 19.5510 6.7479 5.4019 19.2707 4.6730 19.9775 1.2942 0.4528 1.0585 0.3699 2.2788 2.8830 68.1804 3.7248 0.3722 5.1601 13.0288 43.5382 209.8896 9.1558 13.7265 60.4682 30.1175 8.7937 1.6852 20.8492 23.7136 71.3556 1.1328 12.4709 32.6647 2.9768 47.7864 60.5832
temp: 298.150 k
press: 1.00000 atm
elementType: 15 8 8 8 8 8 7 7 6 6 6 6 6 6 1 1 1 1 1 1 1 1 1 1 1 1 1 1 1
symmnumber: 1
zpe: 597296.1 jmol-1
zpe.correction: 0.227498 hartree
zpe.thermalcorrener: 0.244744 hartree
zpe.thermalcorrenthalpy: 0.245688 hartree
zpe.thermalcorrgfe: 0.180202 hartree
zpe.sumelectzpe: -1063.338536 hartree
zpe.sumelectthermal: -1063.321290 hartree
zpe.sumelectthermalent: -1063.320346 hartree
zpe.sumelectthermalfe: -1063.385831 hartree
dipole: -1.5620 -1.8627 -0.8576
dipole: 2.5778
quadrupole: -79.1206 -97.4400 -91.9477
quadrupole: -3.2443 4.0544 4.8800
quadrupole: 10.3821 -7.9372 -2.4449 -3.2443 4.0544 4.8800
hfenergy: -1063.5660336 hartree
pointgroup: C01 [X(C6H15N2O5P1)]
dipole: -0.6086656 0.4971728 0.641007 debye
polarizability: 139.2412791|-5.0532626|104.6415202|-1.9301961|2.9476131|109.8974194 unknown
InChI: InChI=1S/C6H15N2O5P/c7-5(6(9)10)3-1-2-4-8-14(11,12)13/h5,8-9,11-12H,1-4,7H2
charge 0 multiplicity 1
29 atoms
P  4.272928 0.004708 -0.09464
O  -4.358763 1.284789 1.237191
O  4.349587 1.290576 -1.259542
O  5.221866 0.496484 1.266902
O  -4.035636 1.325743 -1.063021
O  4.714551 -1.38167 -0.745916
N  2.754361 0.247013 0.619738
N  -3.601277 -1.544235 -1.045803
C  -1.026211 -0.244686 0.000151
C  0.336558 -0.310666 0.725354
C  -2.164125 -0.818848 0.872452
C  -3.572019 -0.775943 0.203024
C  1.482088 0.269746 -0.127868
C  -4.005104 0.692437 0.015213
H  -1.246217 0.80711 -0.274915
H  -0.960718 -0.819201 -0.945347
H  0.579897 -1.357137 0.991351
H  0.269675 0.255581 1.6787
H  -2.21381 -0.273953 1.835035
H  -1.956161 -1.882067 1.093778
H  -4.282522 -1.232413 0.916052
H  1.23425 1.302378 -0.449256
H  1.603885 -0.336184 -1.045484
H  2.754881 0.565746 1.590029
H  -3.108898 -1.080159 -1.816866
H  -4.542902 -1.828484 -1.333298
H  -4.61317 2.236109 1.08606
H  4.945921 1.084134 -2.02476
H  6.080185 0.009891 1.346386
