program: Gaussian 09
title: 000160984
version: EM64L-G09RevD.01
frameworkgroup: C1[X(C19H12O2)]
method: RPBEPBE
basis: SDD
operation: Freq
keyword: #pfreq=noraman
keyword: PBEPBE/SDD
title: #p freq=noraman PBEPBE/SDD
converged: YES YES NO NO
title: Mulliken charges:
elementType: O O C C C C C C C C C C C C C C C C C C C H H H H H H H H H H H H
charge: -0.245143 -0.201188 0.226081 0.252540 0.420034 0.137321 -0.367627 0.133054 -0.444932 -0.378588 -0.389222 0.333502 -0.433709 0.044767 -0.257238 -0.244184 -0.369277 -0.398143 -0.235841 -0.242152 -0.238008 0.245118 0.247711 0.269101 0.226518 0.245420 0.232654 0.234196 0.275262 0.233463 0.229885 0.227190 0.231434
chargesum: 0.00000
title: Mulliken charges with hydrogens summed into heavy atoms:
elementType: O O C C C C C C C C C C C C C C C C C C C
charge: -0.245143 -0.201188 0.226081 0.252540 0.420034 0.137321 -0.122510 0.133054 -0.197221 -0.109487 -0.162704 0.333502 -0.188289 0.044767 -0.024584 -0.009988 -0.094015 -0.164680 -0.005957 -0.014961 -0.006574
polarizability: 4.04237602e+02 9.09746633e+00 2.36075039e+02 -5.95111252e+00 -6.04122808e+00 8.85498359e+01
1716.lowfreq: -7.4669 -0.2054 -0.0005 -0.0005 0.0004 3.4077 37.6476 46.8028 73.5973
frequency: 37.6418 46.8009 73.5962 81.5265 122.6322 155.3307 184.5850 212.7054 252.9747 279.7428 311.2061 340.9612 357.7025 402.9115 404.4475 416.2244 426.0373 501.1085 510.8605 529.5869 534.1505 551.4902 573.1196 592.8865 615.8511 659.4081 680.6977 688.4831 697.2587 728.7723 740.0471 759.5403 776.8507 786.3538 793.5930 831.8187 845.2767 855.2037 869.5613 884.8031 913.6141 929.9776 957.7493 973.8194 974.4543 976.9559 988.2583 994.8397 996.5451 1019.5404 1035.7426 1043.6795 1086.3582 1092.0828 1150.4066 1175.2419 1177.6909 1200.4781 1209.7189 1229.4018 1245.5402 1262.2328 1288.4040 1319.1569 1344.2110 1367.8507 1385.6764 1410.8144 1428.7567 1431.8375 1438.4816 1455.8581 1485.2850 1519.7244 1562.0866 1579.5115 1591.2689 1597.2604 1610.5325 1628.8654 1662.9693 3122.3931 3126.3338 3132.8626 3135.5433 3138.7115 3145.8824 3149.8108 3157.5144 3162.6216 3168.3992 3178.6563 3185.4437
redmass: 5.2637 3.9738 6.2037 5.4824 4.5858 7.0498 4.5870 5.0226 6.6128 4.6381 5.9095 7.7611 4.9673 2.9903 4.6201 5.2623 3.0350 5.2358 4.1698 7.9007 3.7101 3.2910 8.1670 7.0176 6.4329 6.7909 4.0173 6.0091 1.7259 4.8387 6.2521 1.3056 2.2938 6.3640 2.7959 1.4604 1.3180 6.5703 4.0914 1.7265 1.4313 1.5409 1.3489 2.2792 2.3418 1.3935 5.0507 1.3577 1.3792 4.3065 2.1664 2.2798 2.0971 1.7140 1.2892 1.0533 1.1362 1.1428 2.2687 1.7490 2.7747 1.9336 2.0071 1.4596 2.0648 3.7786 5.2556 3.5707 4.3955 3.1891 2.4634 2.6556 2.3314 3.9560 7.1035 5.6786 7.1902 5.9270 5.9950 6.3923 12.5179 1.0856 1.0869 1.0882 1.0883 1.0895 1.0938 1.0939 1.0908 1.0993 1.0999 1.0961 1.0956
irintensity: 1.1882 0.2942 0.6125 0.6707 0.0619 0.2800 0.6288 1.8183 1.7190 2.7490 0.6702 2.7190 0.5604 0.2986 0.6529 3.4481 5.5945 8.2032 13.3149 1.2152 0.1528 1.3950 5.7366 28.7970 0.7364 5.7919 2.2159 4.2254 52.7066 3.6876 1.0142 38.1458 57.1518 5.5501 5.1099 76.1969 11.3992 58.7016 11.2096 7.6864 14.0819 1.9758 2.6674 12.5493 4.8676 1.2832 0.3320 0.0998 0.4163 0.7493 10.8255 13.9916 20.4505 1.9203 0.9561 0.0188 5.5351 11.0369 16.5555 0.1945 36.5648 1.3314 5.1122 29.7101 40.5239 4.9743 2.1053 8.2953 2.5259 7.2493 11.3566 4.6219 13.4027 49.2151 49.2007 4.3768 23.3812 16.7835 6.5298 10.7841 481.9858 6.0608 2.8457 2.9876 1.8704 7.4806 28.8269 12.3777 24.1728 39.4369 28.7130 5.5982 7.0251
temp: 298.150 k
press: 1.00000 atm
elementType: 8 8 6 6 6 6 6 6 6 6 6 6 6 6 6 6 6 6 6 6 6 1 1 1 1 1 1 1 1 1 1 1 1
symmnumber: 1
zpe: 655917.2 jmol-1
zpe.correction: 0.249826 hartree
zpe.thermalcorrener: 0.265251 hartree
zpe.thermalcorrenthalpy: 0.266196 hartree
zpe.thermalcorrgfe: 0.206487 hartree
zpe.sumelectzpe: -880.289813 hartree
zpe.sumelectthermal: -880.274387 hartree
zpe.sumelectthermalent: -880.273443 hartree
zpe.sumelectthermalfe: -880.333152 hartree
dipole: -3.2646 -4.1958 -0.3006
dipole: 5.3247
quadrupole: -99.0725 -118.7655 -125.5720
quadrupole: -10.8868 -2.5868 -3.0351
quadrupole: 15.3975 -4.2955 -11.1020 -10.8868 -2.5868 -3.0351
hfenergy: -880.5396384 hartree
pointgroup: C01 [X(C19H12O2)]
dipole: 1.2663311 -1.6350156 -0.3343233 debye
polarizability: 402.9811436|-6.2753314|224.8582172|-20.6852997|39.9667072|101.0231154 unknown
InChI: InChI=1S/C19H12O2/c20-19-16(13-6-2-1-3-7-13)12-17-15-9-5-4-8-14(15)10-11-18(17)21-19/h1-12H
charge 0 multiplicity 1
33 atoms
O  0.04426 2.397209 0.522465
O  -2.22136 2.680532 0.707368
C  1.073494 0.226566 0.076598
C  2.296758 -0.539157 -0.108451
C  3.567783 0.150616 -0.042575
C  1.178471 1.615724 0.322444
C  -0.252597 -0.332295 0.032574
C  -1.414537 0.415442 0.204603
C  3.598045 1.568014 0.206657
C  2.427251 2.295976 0.38928
C  2.304287 -1.948721 -0.354579
C  -2.75987 -0.215136 0.10754
C  4.781829 -0.585648 -0.224824
C  -1.309309 1.85915 0.492695
C  3.505954 -2.64529 -0.528472
C  4.757315 -1.962025 -0.464372
C  -3.865617 0.242523 0.878953
C  -2.958476 -1.32898 -0.759386
C  -5.113822 -0.411117 0.802177
C  -4.207274 -1.97798 -0.835903
C  -5.292584 -1.524973 -0.04967
H  -0.362832 -1.409104 -0.125602
H  4.569393 2.073217 0.253301
H  2.429249 3.371861 0.582949
H  1.361796 -2.502555 -0.407939
H  5.736186 -0.04859 -0.17229
H  3.487015 -3.724506 -0.714864
H  5.69048 -2.518014 -0.602239
H  -3.745576 1.111616 1.529759
H  -2.141744 -1.665576 -1.408696
H  -5.9501 -0.045553 1.408183
H  -4.338711 -2.824783 -1.518661
H  -6.265458 -2.025144 -0.110222
