program: Gaussian 09
title: 000160940
version: EM64L-G09RevD.01
frameworkgroup: C1[X(C16H11ClN2O2)]
method: RPBEPBE
basis: SDD
operation: Freq
keyword: #p
keyword: freq=noraman
keyword: PBEPBE/SDD
title: #p freq=noraman PBEPBE/SDD
converged: YES YES NO NO
title: Mulliken charges:
elementType: Cl O O N N C C C C C C C C C C C C C C C C H H H H H H H H H H H
charge: -0.051737 -0.430055 -0.321554 -0.508288 -0.034686 0.229903 0.346316 -0.019831 0.351381 -0.349297 -0.325095 0.039586 -0.290071 -0.366246 -0.257176 -0.383190 -0.095615 -0.295475 -0.217727 -0.252394 0.154026 0.377666 0.240533 0.257938 0.288052 0.272840 0.258634 0.240462 0.277274 0.234312 0.238785 0.390727
chargesum: 0.00000
title: Mulliken charges with hydrogens summed into heavy atoms:
elementType: Cl O O N N C C C C C C C C C C C C C C C C
charge: -0.051737 -0.039328 -0.321554 -0.130622 -0.034686 0.229903 0.346316 -0.019831 0.351381 -0.108764 -0.067157 0.039586 -0.002020 -0.093405 0.001458 -0.142728 -0.095615 -0.018201 0.016585 -0.013609 0.154026
polarizability: 3.68386298e+02 -1.08481252e+01 2.35565348e+02 -8.46287438e+00 -2.96853403e+00 9.53929089e+01
1716.lowfreq: -1.9379 -0.0015 -0.0008 -0.0007 2.3657 7.6794 24.5469 37.1865 59.8795
frequency: 24.5171 37.1675 59.8791 83.5443 102.5501 129.9638 151.5128 179.6012 192.1199 235.3652 247.1911 263.9941 282.2407 320.0113 362.7014 397.9583 422.4931 426.5032 456.1242 491.0425 501.2534 517.5034 533.3088 574.8029 578.1381 586.6450 608.9346 610.3386 634.9752 658.8168 683.0411 727.7484 742.9362 768.9319 775.7283 784.3955 804.5145 820.5214 835.6100 847.8423 850.3378 883.8310 888.5601 898.9586 954.1338 958.8714 976.4635 995.2630 1014.6105 1035.0795 1055.0409 1065.4891 1094.1439 1117.5676 1163.5888 1169.4122 1180.8171 1208.9475 1233.1835 1255.0238 1288.1099 1322.2214 1333.2835 1336.4233 1357.2948 1390.2260 1394.5176 1421.9453 1435.8500 1441.8623 1460.0604 1497.3000 1528.1833 1548.3778 1572.0168 1581.6468 1605.6568 1616.5863 1646.7524 3124.2722 3138.0024 3143.6210 3161.0581 3175.9300 3177.4592 3182.9993 3184.9619 3188.3026 3231.2693 3533.1053
redmass: 7.4583 6.4198 6.3946 8.7212 7.4327 5.3015 5.1499 6.1586 7.7257 6.8486 5.7750 5.9304 6.1760 6.9637 10.5968 7.7225 3.1577 3.2330 4.9226 7.4661 3.4915 3.3703 5.8611 7.6957 1.2118 5.7231 5.9942 5.8232 3.8705 5.8049 4.3161 5.3106 2.5910 2.6218 1.7504 2.9516 3.8909 1.7239 1.5131 2.4290 2.5852 1.7651 2.7943 1.5065 1.3925 1.3584 1.3637 1.3351 5.0707 3.0696 2.6597 1.8173 2.6015 1.8909 1.5727 1.5190 1.1016 2.0934 1.6894 1.5628 2.4201 2.0266 2.0075 3.3160 3.0192 6.5774 4.3291 3.8086 2.4250 2.6943 2.5731 3.4564 3.9821 7.4479 6.2197 7.0882 5.7213 4.2813 2.4224 1.0904 1.0877 1.0887 1.0907 1.0961 1.0941 1.0963 1.0934 1.0954 1.0798 1.0642
irintensity: 0.3964 0.2380 0.4585 1.1902 0.8999 0.6323 1.4993 1.4526 0.9651 1.8508 2.5138 1.9774 6.6871 0.5539 5.9728 12.1071 3.9445 21.8245 1.9914 25.0884 1.6694 15.5378 0.8139 19.6595 113.0366 26.1219 32.4011 12.5989 15.1741 1.5039 44.6969 0.1722 22.0982 4.8783 70.2418 7.0502 18.3400 86.5903 13.4939 81.9104 53.4780 10.8832 9.0198 28.4613 0.3231 1.7821 1.8982 2.2847 289.4534 7.2186 17.6891 24.8041 55.9169 131.4281 104.2799 48.6461 0.2941 27.8993 12.6691 0.1758 33.9453 38.4570 50.1279 102.1009 96.0362 25.6230 66.5761 96.3383 44.8978 94.8618 88.4119 69.4807 384.1729 126.8927 252.0568 298.1680 39.7760 252.9869 99.4372 27.6703 8.1769 2.3856 12.4655 2.8459 10.0191 2.1463 0.8271 10.6163 186.6530 77.2359
temp: 298.150 k
press: 1.00000 atm
elementType: 17 8 8 7 7 6 6 6 6 6 6 6 6 6 6 6 6 6 6 6 6 1 1 1 1 1 1 1 1 1 1 1
symmnumber: 1
zpe: 612973.0 jmol-1
zpe.correction: 0.233469 hartree
zpe.thermalcorrener: 0.250257 hartree
zpe.thermalcorrenthalpy: 0.251201 hartree
zpe.thermalcorrgfe: 0.187617 hartree
zpe.sumelectzpe: -1334.905603 hartree
zpe.sumelectthermal: -1334.888815 hartree
zpe.sumelectthermalent: -1334.887871 hartree
zpe.sumelectthermalfe: -1334.951455 hartree
dipole: -5.6857 -0.5940 0.6121
dipole: 5.7494
quadrupole: -130.2703 -115.9006 -131.0329
quadrupole: -3.3513 -0.5887 2.4477
quadrupole: -4.5357 9.8340 -5.2983 -3.3513 -0.5887 2.4477
hfenergy: -1335.1390722 hartree
pointgroup: C01 [X(C16H11Cl1N2O2)]
dipole: 2.2476332 0.0698334 0.2445152 debye
polarizability: 366.1866285|-20.2792321|237.5618758|8.4208451|5.6710286|95.5960511 unknown
InChI: InChI=1S/C16H11ClN2O2/c17-10-5-6-11-14(7-8-18-15(11)9-10)19-13-4-2-1-3-12(13)16(20)21/h1-9,19-20H
charge 0 multiplicity 1
32 atoms
Cl -5.925097 1.887651 0.550508
O  3.966403 2.745533 -0.603427
O  1.67173 2.48389 -0.572909
N  0.70786 0.059167 -0.070737
N  -2.922696 -2.160082 -0.683019
C  -1.738562 -0.058806 -0.018303
C  -0.458084 -0.709518 -0.232867
C  -2.938719 -0.831147 -0.27194
C  2.014362 -0.348228 0.217238
C  -1.873618 1.29414 0.431518
C  -0.46649 -2.051557 -0.658029
C  3.097803 0.596539 0.047432
C  -4.221958 -0.22009 -0.0952
C  2.330404 -1.642243 0.730086
C  -3.132535 1.876995 0.60191
C  -1.709009 -2.719555 -0.858546
C  -4.295069 1.102556 0.326047
C  4.434415 0.20216 0.338692
C  3.657556 -1.997777 1.01912
C  4.725508 -1.086187 0.809019
C  2.824473 1.971835 -0.391974
H  0.640064 1.077308 -0.263292
H  -0.9887 1.894513 0.667067
H  0.459204 -2.578082 -0.89795
H  -5.109021 -0.824161 -0.299824
H  1.527217 -2.350333 0.943554
H  -3.230909 2.909211 0.948876
H  -1.70638 -3.762728 -1.197082
H  5.229712 0.937997 0.193085
H  3.863426 -2.994844 1.424412
H  5.756559 -1.377548 1.029544
H  3.684651 3.657292 -0.883707
