program: Gaussian 09
title: 000160924
version: EM64L-G09RevD.01
frameworkgroup: C1[X(C20H14O2)]
method: RPBEPBE
basis: SDD
operation: Freq
keyword: #pfreq=noraman
keyword: PBEPBE/SDD
title: #p freq=noraman PBEPBE/SDD
converged: YES YES NO NO
title: Mulliken charges:
elementType: O O C C C C C C C C C C C C C C C C C C C C H H H H H H H H H H H H H H
charge: -0.165063 -0.153666 0.221232 0.088159 0.025147 0.070282 0.262513 0.258194 0.228686 0.226024 -0.169799 -0.164853 -0.866441 -0.801044 -0.398538 -0.389126 -0.380741 -0.394876 -0.256515 -0.261341 -0.242157 -0.236597 0.229301 0.276472 0.242733 0.278557 0.250710 0.215397 0.255912 0.250028 0.268853 0.287743 0.233419 0.235054 0.235187 0.241150
chargesum: 0.00000
title: Mulliken charges with hydrogens summed into heavy atoms:
elementType: O O C C C C C C C C C C C C C C C C C C C C
charge: -0.165063 -0.153666 0.221232 0.088159 0.025147 0.070282 0.262513 0.258194 0.228686 0.226024 -0.169799 -0.164853 -0.117934 -0.056380 -0.142626 -0.139098 -0.111888 -0.107133 -0.023097 -0.026286 -0.006970 0.004554
polarizability: 3.85263778e+02 8.35401267e+00 2.54665338e+02 1.39066148e+00 3.82591303e+00 1.03753889e+02
1716.lowfreq: -7.8522 -0.0005 -0.0004 -0.0003 5.3337 6.0097 42.9580 48.0092 79.1714
frequency: 42.9267 47.9938 79.1683 105.9375 122.0447 131.0977 133.8009 179.1466 205.2918 254.5340 271.7255 280.7416 306.4834 322.6065 342.1106 352.8376 370.6639 378.7317 410.1321 440.7319 451.5333 458.3847 471.1322 514.3560 519.5546 538.0155 559.1121 588.6423 608.1084 645.3561 660.9674 682.4903 702.8388 729.4779 752.1860 769.2588 775.1240 800.4781 813.9239 836.8420 855.6738 881.7291 903.6673 926.8345 964.3151 975.3241 983.3711 995.0838 1000.8529 1006.0292 1032.6730 1037.3782 1038.0573 1048.4717 1064.7042 1079.8050 1100.4190 1123.2385 1149.6719 1177.6962 1184.6962 1222.3771 1233.5432 1271.1858 1283.4332 1301.1297 1353.9189 1354.9332 1383.2386 1397.5410 1400.4227 1409.7911 1417.4615 1431.6517 1441.5218 1456.7646 1468.6908 1474.6442 1479.5895 1492.5767 1513.9556 1544.0190 1566.0569 1574.2129 1578.4445 1590.4415 1610.5686 1618.2761 2976.1006 2990.8250 3053.3695 3073.0068 3111.1102 3118.2480 3133.6224 3134.6493 3147.9506 3150.3290 3165.1472 3168.0992 3176.3543 3179.6608
redmass: 4.2916 5.4118 3.4674 1.8098 3.0608 3.5112 3.8233 3.8745 4.6206 4.5879 1.6636 3.6757 5.9890 6.6667 5.5509 4.3997 4.7545 2.5140 3.0061 4.5831 4.8986 3.5255 5.1261 5.6716 4.2373 5.2255 3.5461 6.1904 3.3160 5.9533 5.2782 5.5786 4.5371 4.9494 4.7262 1.3592 1.5799 2.4880 4.6611 4.4034 5.6445 1.6590 1.4775 4.1521 1.3804 1.7989 2.0196 1.3380 1.5020 2.6101 1.8200 2.4774 1.5795 1.9344 2.3290 2.2099 2.3669 2.7705 2.1623 1.0862 1.0906 2.1147 2.0667 4.6405 1.8585 2.1194 4.6156 3.5985 7.5822 1.3452 1.2222 2.8670 5.5163 2.3668 2.4949 1.1752 1.3377 1.4813 1.6471 1.1559 2.0705 5.6236 6.8023 9.0786 7.3920 8.0730 6.9590 6.4793 1.0424 1.0426 1.0945 1.0919 1.0960 1.0976 1.0859 1.0863 1.0907 1.0902 1.0972 1.0935 1.0984 1.0961
irintensity: 0.9173 1.8367 0.3705 1.0334 1.4918 0.4822 0.0323 2.1541 1.0827 2.7051 0.2033 1.6805 3.2587 1.0626 1.3632 1.6565 2.1296 0.8896 0.6793 2.4608 6.2727 2.6700 1.4476 1.0504 0.8219 4.0829 5.9828 0.8465 1.8580 1.6338 2.9093 5.8641 10.8866 2.3345 1.8192 88.2547 48.9276 16.5276 2.5569 1.9282 8.9402 0.2419 1.1431 34.5713 1.0487 3.8553 4.9533 0.0182 0.3771 1.9614 11.0103 2.0023 0.5047 0.4832 2.5927 0.1077 15.1597 19.8333 0.0391 0.4959 0.2694 34.2665 15.8434 27.3545 30.1713 5.4162 12.1925 11.5190 13.9725 12.1088 22.1257 7.0194 9.9591 37.0876 24.2867 7.7758 46.4465 27.8181 4.4504 15.6030 36.9831 169.0490 37.4071 143.4550 25.6721 52.8759 22.3465 23.0669 24.2678 10.9041 17.5315 17.9497 8.8352 6.9255 2.1069 3.0352 4.4375 12.2443 23.2531 20.1815 28.4798 14.0937
temp: 298.150 k
press: 1.00000 atm
elementType: 8 8 6 6 6 6 6 6 6 6 6 6 6 6 6 6 6 6 6 6 6 6 1 1 1 1 1 1 1 1 1 1 1 1 1 1
symmnumber: 1
zpe: 727539.1 jmol-1
zpe.correction: 0.277105 hartree
zpe.thermalcorrener: 0.294381 hartree
zpe.thermalcorrenthalpy: 0.295325 hartree
zpe.thermalcorrgfe: 0.232555 hartree
zpe.sumelectzpe: -919.500565 hartree
zpe.sumelectthermal: -919.483289 hartree
zpe.sumelectthermalent: -919.482345 hartree
zpe.sumelectthermalfe: -919.545115 hartree
dipole: -3.3980 -6.2130 -0.7242
dipole: 7.1185
quadrupole: -108.5179 -127.9555 -132.5071
quadrupole: -15.8171 -4.0319 -0.2031
quadrupole: 14.4756 -4.9620 -9.5136 -15.8171 -4.0319 -0.2031
hfenergy: -919.7776705 hartree
pointgroup: C01 [X(C20H14O2)]
dipole: -1.3518477 -2.4183091 -0.409683 debye
polarizability: 385.0940479|6.6214409|254.0457608|9.8402562|9.2979053|104.5431964 unknown
InChI: InChI=1S/C20H14O2/c1-11-13-7-3-4-8-14(13)12(2)18-17(11)15-9-5-6-10-16(15)19(21)20(18)22/h3-10H,1-2H3
charge 0 multiplicity 1
36 atoms
O  0.969962 3.162958 -0.450604
O  3.079426 2.279458 1.272012
C  0.221663 -0.427439 0.014062
C  -0.103635 0.996703 -0.062849
C  -0.812896 -1.368418 0.200699
C  -1.442821 1.454996 -0.097971
C  -2.190386 -0.929877 0.082783
C  -2.505317 0.471011 -0.103818
C  1.657346 -0.823273 -0.096696
C  2.687132 0.085388 0.305216
C  1.020537 1.975286 -0.015169
C  2.336385 1.488279 0.627583
C  -0.565345 -2.815495 0.605823
C  -1.804274 2.928987 -0.102579
C  -3.270902 -1.873193 0.115034
C  -3.878104 0.851294 -0.27752
C  2.073647 -2.075806 -0.627915
C  4.053336 -0.292931 0.293646
C  -4.599209 -1.470523 -0.051869
C  -4.906627 -0.094204 -0.257182
C  3.436165 -2.439499 -0.66906
C  4.434108 -1.562602 -0.177987
H  -0.721211 -3.531205 -0.225062
H  0.453154 -2.963747 0.991944
H  -1.264861 -3.100088 1.411883
H  -1.020945 3.546606 0.359086
H  -1.906624 3.309711 -1.13692
H  -2.754837 3.106468 0.426202
H  -3.055417 -2.936577 0.247699
H  -4.127484 1.900987 -0.452012
H  1.333896 -2.760742 -1.048351
H  4.793353 0.440749 0.630099
H  -5.403723 -2.213791 -0.035351
H  -5.94561 0.219542 -0.403415
H  3.720876 -3.40799 -1.094867
H  5.488946 -1.854926 -0.200074
