program: Gaussian 09
title: 000160895
version: EM64L-G09RevD.01
frameworkgroup: C1[X(C24H18O3)]
method: RPBEPBE
basis: SDD
operation: Freq
keyword: #pfreq=noraman
keyword: PBEPBE/SDD
title: #p freq=noraman PBEPBE/SDD
converged: YES YES NO NO
title: Mulliken charges:
elementType: O O O C C C C C C C C C C C C C C C C C C C C C C C C H H H H H H H H H H H H H H H H H H
charge: -0.140975 -0.170438 -0.145259 -0.451534 -0.506002 0.142083 -0.008777 -0.030838 0.254485 0.259826 0.518748 0.443910 -0.374058 -0.367372 -0.447655 -0.360537 -0.410322 -0.368359 -0.206900 -0.207061 -0.392296 -0.393099 0.440248 -0.230195 -0.244401 -0.242813 -0.810051 0.315866 0.271522 0.278664 0.280422 0.238648 0.242762 0.241388 0.267478 0.242521 0.242652 0.227524 0.226773 0.227671 0.231716 0.230561 0.233957 0.223875 0.225641
chargesum: 0.00000
title: Mulliken charges with hydrogens summed into heavy atoms:
elementType: O O O C C C C C C C C C C C C C C C C C C C C C C C C
charge: -0.140975 -0.170438 -0.145259 -0.135668 -0.234480 0.142083 -0.008777 -0.030838 0.254485 0.259826 0.518748 0.443910 -0.095393 -0.086950 -0.209007 -0.117776 -0.168934 -0.100881 0.035621 0.035592 -0.164772 -0.166326 0.440248 -0.002524 -0.012685 -0.012253 -0.126578
polarizability: 3.13057665e+02 1.94944444e+01 2.73750906e+02 8.09913908e+00 -2.87609039e+01 2.19276375e+02
1716.lowfreq: -40.8949 -6.7367 -0.0008 -0.0006 0.0003 2.1644 4.3654 15.0002 22.4296
frequency: -40.7910 14.8104 22.2991 25.5006 29.0508 34.8078 48.6318 58.6515 103.9955 114.9124 127.6191 135.4613 161.6778 175.8719 209.1372 217.0390 236.6088 253.7666 312.6831 327.7734 335.4253 354.5095 402.4632 403.3862 406.0390 437.2364 457.0161 499.0022 502.5091 516.6023 524.9956 548.2254 568.7700 608.1160 609.8129 615.6172 631.9013 642.7392 690.8177 703.8783 708.2873 725.9320 749.7445 773.0608 774.6428 785.8044 800.9600 806.8399 844.4321 849.0900 857.4399 859.6893 863.6821 904.2961 912.6378 928.2828 957.4128 964.8096 973.6387 981.5552 985.2957 987.2775 990.5502 998.5184 1007.3315 1013.5952 1014.2857 1028.3863 1038.7370 1047.6799 1070.4907 1082.5135 1086.0662 1124.3222 1134.6493 1172.4268 1173.7559 1180.6858 1185.5261 1194.9022 1196.8149 1205.9257 1214.6929 1224.1833 1248.2091 1253.7383 1281.0716 1284.7014 1324.9374 1336.2270 1376.6414 1383.1727 1396.5900 1409.8736 1410.6745 1440.4994 1452.9124 1454.1892 1471.9465 1472.9716 1482.0092 1507.9171 1585.8502 1589.8047 1590.5086 1598.8589 1609.4244 1622.0222 1624.2316 1627.6850 1664.1738 2963.2438 2973.6453 3034.9581 3054.6803 3083.6111 3109.4601 3119.2505 3121.6904 3124.0307 3133.7839 3136.4131 3139.5191 3147.7821 3150.5419 3153.4855 3164.8405 3165.3772 3174.3580
redmass: 1.0176 6.2093 5.6008 4.5703 4.9526 4.3581 5.1317 5.8221 7.7709 5.2737 6.1571 6.4492 5.6634 6.4393 5.3156 5.2625 6.9799 4.5148 5.3868 9.2626 5.1046 2.9219 2.8237 3.3494 2.8585 4.7270 4.1832 4.5443 3.7406 6.8485 7.5914 6.6575 4.6715 6.1486 3.8330 6.4194 6.1649 6.1833 5.5945 2.8631 2.7384 2.7331 2.4639 3.6616 1.4408 3.5165 2.5836 2.5311 3.4421 1.2641 1.3947 3.2625 3.8442 3.4713 1.5552 1.4759 1.4275 5.2544 1.3892 1.4137 1.4259 1.4266 5.5359 1.3207 2.5941 1.3706 2.9512 2.2615 3.3167 1.5648 3.3644 2.2728 1.7124 1.3432 1.3315 1.1082 1.0540 2.7504 2.0555 1.1389 1.1290 1.6590 1.6270 3.0792 3.9240 1.8505 1.6126 1.5806 1.3894 1.2716 6.1106 5.2728 1.2256 6.5427 2.7816 2.1783 2.5230 2.5884 1.0909 1.0591 2.1945 2.6534 6.2092 7.0673 6.4481 7.6678 5.9734 7.9339 9.3872 7.7641 11.9787 1.0821 1.0386 1.0830 1.0949 1.0997 1.0873 1.0884 1.0857 1.0882 1.0964 1.0916 1.0866 1.0960 1.0955 1.0904 1.1015 1.0957 1.1004
irintensity: 0.4469 1.4848 0.6956 0.7391 1.1848 0.6598 2.2924 1.0302 0.5681 0.7559 0.0959 5.2548 0.1351 0.2385 1.0855 1.0388 0.1285 1.0863 3.3060 7.8682 5.5332 0.3524 0.4458 3.2356 0.2915 0.7858 1.5032 13.8665 5.1023 5.1949 1.4163 16.3078 37.9815 40.5443 0.2610 2.7695 9.2936 9.1440 2.6608 9.6069 56.9610 25.0426 15.5713 3.7485 95.1554 1.1728 16.6814 20.2721 7.7433 0.4443 0.5116 0.9230 7.6615 0.6125 0.1433 1.1860 0.2749 52.3053 0.4498 0.1338 3.6935 0.1254 2.9588 0.1680 4.9017 0.4745 5.4419 7.4092 97.5503 17.8981 153.2206 8.2039 21.6005 9.8047 162.5310 23.1497 0.0930 1.3148 22.9559 4.3912 3.8123 3.0942 92.7435 0.0810 334.4539 21.3877 4.8014 28.2065 7.4965 3.4137 2.4822 0.5318 9.8315 11.1964 1.6248 6.4194 1.9222 0.8809 12.6894 13.4707 19.0133 36.4943 16.0250 81.9090 75.2419 3.1628 16.8769 94.5486 114.7460 38.7544 64.6864 2.1847 43.1782 0.7324 23.0427 17.7610 12.9266 21.0094 4.2849 1.2218 25.1520 11.6079 1.8571 26.7669 7.8979 4.8615 27.5184 4.0991 24.7539
temp: 298.150 k
press: 1.00000 atm
elementType: 8 8 8 6 6 6 6 6 6 6 6 6 6 6 6 6 6 6 6 6 6 6 6 6 6 6 6 1 1 1 1 1 1 1 1 1 1 1 1 1 1 1 1 1 1
symmnumber: 1
zpe: 908574.1 jmol-1
zpe.correction: 0.346058 hartree
zpe.thermalcorrener: 0.368404 hartree
zpe.thermalcorrenthalpy: 0.369348 hartree
zpe.thermalcorrgfe: 0.290406 hartree
zpe.sumelectzpe: -1149.178787 hartree
zpe.sumelectthermal: -1149.156440 hartree
zpe.sumelectthermalent: -1149.155496 hartree
zpe.sumelectthermalfe: -1149.234438 hartree
dipole: -2.2401 -0.7235 1.5296
dipole: 2.8073
quadrupole: -119.3493 -145.1220 -159.3100
quadrupole: 10.7933 -0.5865 -0.0828
quadrupole: 21.9111 -3.8616 -18.0496 10.7933 -0.5865 -0.0828
hfenergy: -1149.5248441 hartree
pointgroup: C01 [X(C24H18O3)]
dipole: 0.8860354 -0.2339943 -0.6164914 debye
polarizability: 315.5815882|-16.2311765|272.0081163|4.5743405|29.0116409|218.4952404 unknown
InChI: InChI=1S/C24H18O3/c1-15-11-13-17(14-12-15)20(16-7-3-2-4-8-16)24(27)21-22(25)18-9-5-6-10-19(18)23(21)26/h2-14,20-21H,1H3
charge 0 multiplicity 1
45 atoms
O  0.255828 -0.549218 1.46909
O  1.55926 -0.680418 -2.302377
O  2.381115 1.983983 1.665319
C  1.380149 0.764862 -0.265851
C  -1.136475 0.162211 -0.456394
C  0.15442 0.06065 0.382096
C  2.073684 -0.211148 -1.254196
C  2.4793 1.124123 0.756686
C  3.434384 -0.493105 -0.716737
C  3.672041 0.278358 0.450911
C  -2.147743 -0.929522 -0.10259
C  -1.700159 1.591462 -0.374022
C  4.415731 -1.368581 -1.22687
C  4.897933 0.193719 1.141679
C  -2.18551 -2.1159 -0.875522
C  -3.026836 -0.813876 1.000666
C  -2.429967 2.109195 -1.474933
C  -1.540842 2.396982 0.78247
C  5.645274 -1.456946 -0.535795
C  5.883566 -0.68449 0.635827
C  -3.083815 -3.157379 -0.557691
C  -3.92142 -1.857621 1.317062
C  -3.970678 -3.045883 0.542979
C  -2.995079 3.401174 -1.420211
C  -2.101544 3.693632 0.835756
C  -2.831986 4.199267 -0.262743
C  -4.959874 -4.151814 0.869382
H  1.010011 1.657239 -0.803107
H  -0.809618 -0.003555 -1.50544
H  4.21935 -1.956843 -2.128609
H  5.067981 0.793215 2.041232
H  -1.502765 -2.227923 -1.727662
H  -3.014322 0.09378 1.613489
H  -2.561356 1.491792 -2.37184
H  -0.973091 2.020477 1.641911
H  6.429251 -2.1280 -0.902976
H  6.846877 -0.775364 1.149316
H  -3.0960 -4.068093 -1.169276
H  -4.591568 -1.750731 2.179139
H  -3.559037 3.786228 -2.277213
H  -1.963717 4.30659 1.73329
H  -3.266498 5.204219 -0.220849
H  -5.927113 -3.985981 0.355692
H  -4.583529 -5.139437 0.549277
H  -5.168915 -4.200331 1.952732
