program: Gaussian 09
title: 000160887
version: EM64L-G09RevD.01
frameworkgroup: C1[X(C19H14O5)]
method: RPBEPBE
basis: SDD
operation: Freq
keyword: #pfreq=noraman
keyword: PBEPBE/SDD
title: #p freq=noraman PBEPBE/SDD
converged: YES YES NO NO
title: Mulliken charges:
elementType: O O O O O C C C C C C C C C C C C C C C C C C C H H H H H H H H H H H H H H
charge: -0.439802 -0.177438 -0.165212 -0.172983 -0.375974 0.264679 -0.618231 -0.587626 0.410701 0.036449 0.136289 0.164181 -0.750317 0.223955 -0.430164 -0.431937 -0.182466 -0.146886 0.323632 0.118460 0.188904 -0.417377 -0.411916 -0.200434 0.228323 0.236439 0.238891 0.267184 0.249945 0.210371 0.218375 0.246670 0.294057 0.333177 0.292494 0.225134 0.240365 0.360084
chargesum: 0.00000
title: Mulliken charges with hydrogens summed into heavy atoms:
elementType: O O O O O C C C C C C C C C C C C C C C C C C C
charge: -0.106625 -0.177438 -0.165212 -0.172983 -0.015889 0.264679 -0.153469 -0.081552 0.410701 0.036449 0.136289 0.164181 -0.071626 0.223955 -0.183494 -0.137879 -0.182466 -0.146886 0.323632 0.118460 0.188904 -0.124883 -0.186781 0.039932
polarizability: 3.41597635e+02 -1.41189676e+01 2.43725189e+02 2.05189682e+01 2.55849233e+00 1.14683531e+02
1716.lowfreq: -7.8351 -4.4943 -3.1242 -0.0005 -0.0003 0.0002 27.1300 46.6291 61.4061
frequency: 27.1065 46.5899 61.4004 78.3656 89.8557 111.8756 139.6486 177.1483 186.4431 202.5678 219.3669 229.0678 240.0779 272.9170 287.3471 293.7600 303.5430 339.3309 360.1783 371.1164 374.5013 381.9936 400.7697 415.7412 428.8673 440.4714 459.9213 474.2199 506.5805 522.1467 535.7517 551.6175 561.4581 577.3816 607.0397 636.5162 671.7529 679.8112 719.2823 742.3099 762.4143 778.2050 789.2774 800.4571 833.6391 840.9113 863.2279 884.2923 889.3049 895.8248 903.8768 949.5179 954.7623 973.8527 984.0227 1003.2395 1041.6596 1060.7618 1074.1857 1088.8382 1094.2399 1136.0737 1148.9497 1168.3114 1174.1087 1184.7374 1187.5979 1224.4604 1241.8544 1259.3328 1261.1116 1275.1225 1288.3530 1302.6044 1317.8784 1355.9334 1380.9962 1388.9658 1400.7301 1413.2156 1426.8947 1440.0903 1442.8494 1459.1650 1467.5480 1468.5513 1469.6575 1536.8080 1557.2336 1569.1708 1589.5060 1600.3339 1606.5385 1626.8948 2960.7610 2974.7704 3003.5060 3016.5927 3065.8997 3093.0932 3099.2657 3116.9085 3128.6658 3155.0098 3163.4309 3177.7187 3539.0987 3550.1437
redmass: 6.3412 5.3842 6.9666 6.3573 4.8043 4.8624 6.4286 7.7174 6.4239 6.6193 1.0400 4.6748 3.2140 4.2955 1.9814 2.3754 3.6502 4.1340 4.6584 4.0862 4.1039 3.1737 3.7425 1.4748 3.8031 4.1505 6.0433 3.9829 5.6240 3.7646 4.6420 6.0340 4.7726 4.9566 5.0701 5.2368 5.9734 4.3342 3.3586 6.5245 5.7076 3.9372 2.0625 4.1357 2.2525 5.7808 2.8300 4.8188 2.7777 1.9543 1.5381 1.7854 2.0206 3.3895 1.3665 1.3866 3.4230 1.9755 2.1165 1.9181 2.6890 1.9922 1.4870 1.3207 1.3577 1.8997 1.4992 1.8529 2.4875 1.8750 2.4062 2.2102 2.7130 3.5139 2.2917 2.2199 4.8523 1.2937 7.6270 5.0700 1.0991 2.5732 1.2055 2.4360 2.8232 1.0767 1.1061 10.0838 9.7500 7.6021 6.9876 7.7600 7.9096 10.5517 1.0613 1.0380 1.0629 1.0975 1.0974 1.0995 1.0989 1.0894 1.0894 1.0917 1.0951 1.0972 1.0657 1.0660
irintensity: 8.0915 4.0947 0.1033 3.2602 0.7285 0.8706 0.4180 1.4825 0.2567 3.3211 0.2451 0.3464 0.4509 7.8456 64.2923 30.7827 51.4042 31.7168 35.2287 8.8099 4.4446 1.9294 19.0167 88.3526 5.2767 14.6596 7.9778 8.1972 2.4416 9.3327 13.2116 2.6111 0.9899 22.8916 6.9145 2.3703 2.2264 6.5643 39.7057 18.7989 2.8682 7.4784 21.4348 52.9383 14.9551 9.8444 5.1480 38.9049 7.3345 17.9592 3.9180 12.4754 9.2340 29.7031 2.3240 1.2767 35.9225 31.8809 20.2720 74.7846 9.4469 23.4322 55.0510 38.7704 19.9751 25.3390 1.8464 34.6806 188.2868 60.1831 62.3171 403.6139 174.3322 4.9195 50.0479 55.5368 0.3046 19.1874 1.4435 30.7637 10.6513 15.1018 6.3522 4.4870 23.2647 9.2150 7.6277 64.1207 157.4611 41.5150 14.8580 95.3337 30.5682 81.5003 14.4457 33.4042 6.7465 18.6949 30.7397 6.2307 24.5769 13.9875 13.6448 13.4894 6.8171 8.4653 36.5940 4.0752
temp: 298.150 k
press: 1.00000 atm
elementType: 8 8 8 8 8 6 6 6 6 6 6 6 6 6 6 6 6 6 6 6 6 6 6 6 1 1 1 1 1 1 1 1 1 1 1 1 1 1
symmnumber: 1
zpe: 739344.8 jmol-1
zpe.correction: 0.281602 hartree
zpe.thermalcorrener: 0.301613 hartree
zpe.thermalcorrenthalpy: 0.302557 hartree
zpe.thermalcorrgfe: 0.233709 hartree
zpe.sumelectzpe: -1106.872347 hartree
zpe.sumelectthermal: -1106.852335 hartree
zpe.sumelectthermalent: -1106.851391 hartree
zpe.sumelectthermalfe: -1106.920239 hartree
dipole: -1.1150 2.0391 -0.4306
dipole: 2.3636
quadrupole: -79.5948 -145.2680 -142.1739
quadrupole: -24.2633 10.6962 3.0904
quadrupole: 42.7508 -22.9225 -19.8283 -24.2633 10.6962 3.0904
hfenergy: -1107.1539482 hartree
pointgroup: C01 [X(C19H14O5)]
dipole: 0.4454231 -0.80207 -0.151629 debye
polarizability: 341.6927483|-13.7374707|243.2653661|-21.0210776|-5.8217186|115.0482405 unknown
InChI: InChI=1S/C19H14O5/c1-19(24)7-9-5-6-11-16(14(9)13(21)8-19)18(23)10-3-2-4-12(20)15(10)17(11)22/h2-6,20,24H,7-8H2,1H3
charge 0 multiplicity 1
38 atoms
O  4.329788 0.273865 1.658896
O  1.658405 2.20583 0.757333
O  -0.316852 2.017001 -1.278355
O  -2.512667 -2.719894 -0.030372
O  -4.8411 -1.520127 0.653345
C  4.48172 0.176925 0.184289
C  3.846268 -1.141521 -0.321859
C  3.67792 1.390315 -0.340435
C  2.329442 -1.203441 -0.213709
C  1.537572 -0.023413 -0.173606
C  2.224635 1.291747 0.106039
C  0.114586 -0.12591 -0.241557
C  5.970679 0.268465 -0.195966
C  -0.512382 -1.396558 -0.157372
C  1.684202 -2.469509 -0.196747
C  0.287312 -2.568529 -0.128557
C  -0.752992 1.04249 -0.596705
C  -2.008713 -1.554685 -0.057184
C  -2.203763 0.956365 -0.22633
C  -2.819113 -0.307114 0.045677
C  -4.211476 -0.310697 0.371986
C  -2.940386 2.160011 -0.196663
C  -4.941304 0.905831 0.419221
C  -4.310868 2.131839 0.133799
H  4.301468 -2.0003 0.209852
H  4.116663 -1.268305 -1.391487
H  3.725102 1.403606 -1.446621
H  4.107753 2.326043 0.051824
H  6.414504 1.173577 0.252666
H  6.531335 -0.611177 0.176458
H  6.10932 0.317485 -1.291291
H  2.294657 -3.380153 -0.211738
H  -0.221903 -3.535329 -0.067156
H  4.841907 -0.461175 2.084034
H  -2.423501 3.094262 -0.431273
H  -6.008164 0.884504 0.677997
H  -4.889193 3.060478 0.172636
H  -5.794963 -1.368303 0.879529
