program: Gaussian 09
title: 000160885
version: EM64L-G09RevD.01
frameworkgroup: C1[X(C8H7INO4P)]
method: RPBEPBE
basis: SDD
operation: Freq
keyword: #p
keyword: freq=noraman
keyword: PBEPBE/SDD
title: #p freq=noraman PBEPBE/SDD
converged: YES YES NO NO
title: Mulliken charges:
elementType: I P O O O O N C C C C C C C C H H H H H H H
charge: 0.083432 1.332007 -0.530561 -0.649800 -0.645708 -0.571772 -0.403140 0.158083 0.251186 0.213893 -0.321152 -0.270194 -0.317262 -0.374088 -0.138919 0.317938 0.277998 0.294178 0.238398 0.246504 0.406080 0.402899
chargesum: 0.00000
title: Mulliken charges with hydrogens summed into heavy atoms:
elementType: I P O O O O N C C C C C C C C
charge: 0.083432 1.332007 -0.530561 -0.243720 -0.242809 -0.571772 -0.085202 0.158083 0.251186 0.213893 -0.043154 0.023984 -0.078864 -0.374088 0.107585
polarizability: 2.16324050e+02 2.02142641e+01 1.71095116e+02 -8.49505518e+00 7.67629165e+00 7.59473405e+01
1716.lowfreq: -80.7977 -3.8187 -0.0004 -0.0001 0.0017 2.6853 7.2199 18.3242 36.5827
frequency: -80.7961 18.2655 36.4920 60.5792 93.7289 116.6508 163.9035 195.4903 222.8479 228.6397 255.2127 270.7865 301.6860 311.0977 330.8713 357.2959 411.7843 419.2787 504.2524 510.8902 529.6155 574.1962 579.1383 622.8171 630.2982 696.8996 741.7302 748.8432 767.0777 781.4282 794.4879 806.7438 860.6237 895.5089 939.5354 1011.2341 1024.9971 1041.3560 1058.1387 1078.4817 1095.3116 1148.0101 1238.7363 1245.8376 1284.1508 1297.4881 1380.7610 1412.9468 1451.1261 1451.8082 1543.6212 1576.9815 1622.8825 3143.1775 3174.7210 3180.3433 3248.1544 3592.4401 3601.3279 3612.3050
redmass: 1.3351 9.2531 10.3235 6.5520 5.8729 8.5114 4.9520 2.5431 7.3712 3.4910 2.7283 4.6705 7.8162 3.4556 9.2691 7.6773 9.2122 3.0115 3.5625 1.7958 3.1135 4.5963 3.8926 5.7602 5.5919 10.4460 6.4929 4.0171 7.6861 7.5602 1.5274 1.4763 5.6833 1.4245 1.3368 1.2928 1.5256 2.0972 6.1437 3.5768 1.5098 1.3045 2.3190 1.7091 2.2516 2.1752 6.5859 2.3147 4.4337 3.9481 5.8754 6.6738 7.2668 1.0897 1.0954 1.0936 1.0996 1.0665 1.0663 1.0812
irintensity: 150.2311 0.4335 0.2947 0.9757 4.1338 9.9687 3.8292 38.3228 6.4095 38.1439 38.8974 12.2733 15.3070 43.5839 25.3030 12.1232 35.4297 24.1049 48.8673 91.5888 1.4904 3.0261 31.0727 12.8099 2.1218 113.4458 211.1051 15.2278 93.2860 108.8926 85.2537 3.2715 34.4224 20.7206 0.7217 23.5635 72.4891 7.2963 45.7702 157.1052 48.5153 4.2704 42.5430 31.5615 71.0979 19.3813 10.2332 17.6619 6.6492 89.4007 6.6778 11.9701 2.5815 6.3780 6.3077 2.5734 1.0562 67.4197 111.7627 83.5286
temp: 298.150 k
press: 1.00000 atm
elementType: 53 15 8 8 8 8 7 6 6 6 6 6 6 6 6 1 1 1 1 1 1 1
symmnumber: 1
zpe: 372607.1 jmol-1
zpe.correction: 0.141919 hartree
zpe.thermalcorrener: 0.156467 hartree
zpe.thermalcorrenthalpy: 0.157411 hartree
zpe.thermalcorrgfe: 0.097321 hartree
zpe.sumelectzpe: -1016.335626 hartree
zpe.sumelectthermal: -1016.321078 hartree
zpe.sumelectthermalent: -1016.320134 hartree
zpe.sumelectthermalfe: -1016.380224 hartree
dipole: 1.4813 4.2971 0.0838
dipole: 4.5460
quadrupole: -106.0170 -85.5531 -112.8948
quadrupole: 5.2790 -11.0023 -1.2896
quadrupole: -4.5287 15.9352 -11.4065 5.2790 -11.0023 -1.2896
hfenergy: -1016.4775447 hartree
pointgroup: C01 [X(C8H7I1N1O4P1)]
dipole: 0.0910332 1.6676318 0.6400145 debye
dipolederiv: -0.147517 0.157998 0.0764656 0.2306879 -0.3493884 -0.1483347 0.107998 -0.145283 -0.0824468 2.3282658 0.1771189 -0.1946287 0.489841 1.68136 -0.0432071 0.3397273 0.1128496 1.8491623 -1.1479521 -0.2539474 -0.0176136 -0.4236463 -0.5867617 0.0048169 -0.0716578 -0.0322997 -0.4377224 -0.6808356 0.031785 0.2168433 -0.1081303 -0.7793521 -0.2602889 -0.0244052 -0.2814563 -0.6500519 -1.0731791 -0.2598001 0.0885737 -0.4055496 -0.5986865 0.3117331 0.2040505 0.3081561 -0.716701 -0.8259344 -0.0221405 -0.0164053 0.041787 -0.5762927 0.0344739 -0.2496614 -0.018948 -0.6515864 -0.6134618 -0.2784212 -0.0931007 0.0695377 -0.6366936 -0.173522 0.1257349 -0.0087967 -0.2863168 0.090381 -0.1686469 -0.0590789 -0.066618 -0.164621 -0.0701079 -0.0665321 0.0012221 0.0237445 -0.0179471 -0.1282569 -0.017036 -0.513819 0.3136605 0.1811664 -0.1233889 0.1186887 0.0916503 0.8407875 0.3429157 -0.0090644 0.4172626 0.1489682 0.0328338 -0.1638418 -0.0668375 -0.073527 0.0636484 0.4602204 0.0923872 0.3594697 0.2654196 0.0573405 0.0181777 -0.0663204 -0.1521899 -0.097532 0.0874661 0.0076105 0.2074509 -0.2267198 -0.0844543 0.046757 -0.0614828 -0.103247 0.1228629 -0.0186115 -0.097901 0.0597349 -0.0141681 0.0241645 -0.0709411 0.0465892 -0.1265412 0.1960691 -0.4111629 -0.2079838 -0.5383086 0.8057992 0.418756 -0.273452 0.4050819 0.0025345 -0.1451564 0.2571621 0.0589021 0.1706129 -0.2570122 -0.0909402 0.0547248 -0.1189792 -0.1686037 0.1589518 -0.0249318 0.0448434 -0.0095619 0.2633053 -0.0102944 0.0644312 -0.0117032 0.3285398 0.0638417 0.0262264 0.050401 0.048426 0.0859745 -0.0439308 0.0464027 -0.0394377 0.1808935 0.1321088 -0.0598926 0.0082196 -0.0423411 0.0489078 -0.0230778 0.024379 -0.0210574 0.1429856 0.0320456 -0.0546223 0.026753 -0.0851747 -0.0724298 -0.0436907 0.0251374 -0.0498174 0.1567627 -0.0445426 -0.0151424 0.0585822 0.0042182 0.1113952 -0.0164437 0.0681168 -0.0101802 0.1414321 0.3144892 0.0775013 -0.046255 0.0624826 0.3225636 0.0433897 -0.086905 0.073895 0.2314441 0.4506064 0.0771825 0.0294859 0.0316382 0.2147721 -0.1003822 0.0051478 -0.1338832 0.2997847 unknown
polarizability: 193.2096388|-20.3222176|176.2061402|-30.7624429|38.6852638|93.9507279 unknown
InChI: InChI=1S/C8H7INO4P/c9-5-1-2-7-6(3-5)8(4-10-7)14-15(11,12)13/h1-4,10-12H
charge 0 multiplicity 1
22 atoms
I  3.336082 -2.630678 -1.464524
P  -2.958394 -0.697195 -0.357095
O  -1.890693 -0.24336 0.949801
O  -2.009216 -1.802391 -1.258832
O  -3.939009 -1.794266 0.510387
O  -3.662347 0.452948 -1.19131
N  0.464686 2.505939 0.852139
C  0.49557 0.298183 0.238516
C  1.282315 1.499814 0.319527
C  -0.813985 0.644014 0.745975
C  -0.810269 1.989653 1.107594
C  1.069039 -0.895943 -0.272036
C  2.632072 1.532973 -0.093338
C  2.411719 -0.845055 -0.678158
C  3.195606 0.343388 -0.596008
H  0.751068 3.466308 1.028004
H  -1.612809 2.594229 1.522556
H  0.47065 -1.807051 -0.347486
H  3.234882 2.445186 -0.032172
H  4.238243 0.334163 -0.925062
H  -2.186098 -1.78185 -2.234052
H  -4.426012 -1.405809 1.280774
