program: Gaussian 09
title: 000160884
version: EM64L-G09RevD.01
frameworkgroup: C1[X(C18H22N2O4)]
method: RPBEPBE
basis: SDD
operation: Freq
keyword: #p
keyword: freq=noraman
keyword: PBEPBE/SDD
title: #p freq=noraman PBEPBE/SDD
converged: YES YES NO NO
title: Mulliken charges:
elementType: O O O O N N C C C C C C C C C C C C C C C C C C H H H H H H H H H H H H H H H H H H H H H H
charge: -0.193603 -0.207864 -0.211893 -0.128450 -0.331167 -0.368848 0.138411 -0.473611 -0.392872 -0.425291 -0.024646 0.170050 0.113364 -0.723524 -0.714228 -0.716945 0.185332 0.124977 0.346900 -0.279005 -0.329656 -0.251626 -0.221301 -0.222738 0.209055 0.254626 0.212151 0.237551 0.228867 0.241561 0.195303 0.232724 0.235950 0.222056 0.364504 0.206026 0.211931 0.218975 0.212057 0.214620 0.216773 0.235711 0.272834 0.237164 0.239403 0.238390
chargesum: 0.00000
title: Mulliken charges with hydrogens summed into heavy atoms:
elementType: O O O O N N C C C C C C C C C C C C C C C C C C
charge: -0.193603 -0.207864 -0.211893 -0.128450 -0.331167 -0.004343 0.138411 -0.009929 0.056830 0.045138 0.170657 0.170050 0.113364 -0.032794 -0.077296 -0.073495 0.185332 0.124977 0.346900 -0.043294 -0.056822 -0.014462 0.018102 0.015653
polarizability: 2.56925721e+02 1.28877389e+01 2.25299014e+02 4.24779312e+00 -6.17188147e+00 1.70684858e+02
1716.lowfreq: -6.2008 -0.0007 -0.0006 0.0004 0.8943 6.2488 15.5664 29.5103 32.8743
frequency: 15.0794 29.4180 32.8521 34.9212 42.3145 65.3210 86.0117 95.6770 108.5576 120.8231 138.1578 153.8486 162.6983 169.1282 197.8564 201.3748 214.5793 228.4715 233.3392 242.7720 249.3487 262.0814 312.5278 364.9443 371.9680 382.8397 389.3048 396.9941 400.2904 423.7053 441.5213 451.1165 484.7913 522.1405 561.8056 603.5924 612.9457 622.8769 660.1603 672.6318 688.5765 696.3075 712.6583 732.2395 743.0524 772.9784 776.2241 781.6619 812.8926 826.6526 856.2315 896.0317 914.4083 917.2916 946.5706 947.7497 953.0521 963.7558 985.8320 990.0997 991.1987 992.0737 1010.9838 1025.5662 1057.0990 1077.6898 1082.3861 1090.5183 1094.9135 1122.6268 1148.2194 1162.5744 1176.7784 1177.1631 1183.3528 1191.3432 1227.7324 1235.7367 1267.0536 1287.4195 1298.9214 1303.8138 1315.1799 1317.2707 1330.6337 1338.7631 1340.6930 1352.7520 1375.1637 1378.1730 1393.9188 1396.6776 1397.4895 1438.6703 1451.6481 1457.5833 1469.2857 1470.3273 1477.9738 1478.5046 1482.5660 1483.5710 1489.7177 1491.5978 1584.1830 1586.9147 1610.1582 1634.3787 1641.0395 1668.1001 2956.6496 2964.5714 2970.6698 2972.6063 2985.7103 2987.1718 3017.6714 3026.3068 3053.9376 3057.6589 3064.8930 3069.4636 3071.4045 3072.9993 3082.0891 3096.2748 3135.4006 3146.5366 3156.9853 3166.3723 3175.3077 3514.1267
redmass: 4.7507 3.5289 5.5496 3.9989 4.3873 3.6833 4.0156 3.8564 2.9469 3.2021 5.9767 9.2589 3.8419 4.2111 2.1977 2.2757 1.3589 2.7837 3.5071 1.8840 1.4299 2.9844 2.1025 7.0098 6.7916 2.9156 2.3736 8.2033 2.9035 3.9087 2.6938 3.7453 5.1789 6.4003 7.9726 8.5093 6.3782 5.7673 2.7753 5.2582 2.2096 2.6522 7.9822 4.1924 1.6989 1.6109 1.7764 1.7685 2.7397 2.3492 1.2523 2.5933 2.0181 1.4109 1.6127 1.6034 1.5794 2.2947 3.6729 6.0218 2.0038 1.4043 1.3496 2.1113 3.0422 2.9856 1.8899 1.7173 3.1710 1.9627 2.8028 3.0098 1.7816 1.1037 1.1888 2.9964 1.6024 3.6564 1.2524 1.3635 2.5787 1.4004 1.3581 1.4572 1.4240 1.5222 4.5471 1.4282 1.8044 1.2134 9.2974 1.2114 1.2078 2.2596 1.0859 1.0754 1.0655 1.0486 1.1852 1.8998 1.0506 1.0579 1.0417 1.0503 6.4839 10.6600 6.0991 9.4008 6.8852 10.4937 1.0828 1.0372 1.0403 1.0532 1.0374 1.0578 1.0613 1.1003 1.1036 1.0994 1.0991 1.0991 1.0999 1.0992 1.0985 1.1026 1.0857 1.0884 1.0926 1.0961 1.1011 1.0768
irintensity: 1.0788 0.5655 0.2729 0.2995 0.1173 0.6651 0.1969 0.4083 0.5117 0.2255 0.9607 10.5593 0.4515 0.6179 0.5120 1.6073 0.0218 4.7016 1.0863 7.7499 1.6750 1.2733 4.6247 15.5361 4.2370 2.4069 0.6389 1.5211 0.0541 0.7923 3.2868 8.6087 12.2008 28.5534 9.4595 9.2179 1.5549 3.9916 19.9757 32.7229 36.2886 12.5205 7.4632 8.5626 1.7209 10.2974 83.9678 27.8601 39.3139 2.1059 1.3692 37.1178 15.8660 10.3607 13.2286 10.9420 5.7935 13.7714 12.5625 3.8879 41.4931 1.9682 0.7492 1.0182 1.5368 24.8030 3.6376 2.5975 12.0403 2.7158 2.6434 13.1603 13.1509 1.8598 54.9793 44.7269 78.4289 307.6088 19.0002 60.7281 209.1381 32.2881 18.8487 32.2684 21.6385 61.7785 207.2021 5.0669 4.7137 19.4842 5.9279 9.7093 18.5579 22.5357 21.7307 2.1046 2.9367 3.9636 5.2679 2.9046 8.0616 4.6293 16.9835 37.7897 42.2967 272.0136 65.3133 247.7712 276.1482 272.2837 18.4030 29.7644 29.6966 15.2531 29.0012 19.0443 14.1963 0.9105 27.6670 28.4205 18.1244 95.7999 10.4182 58.0376 39.7220 22.6762 0.0995 5.2699 13.5342 21.7393 13.1050 68.6886
temp: 298.150 k
press: 1.00000 atm
elementType: 8 8 8 8 7 7 6 6 6 6 6 6 6 6 6 6 6 6 6 6 6 6 6 6 1 1 1 1 1 1 1 1 1 1 1 1 1 1 1 1 1 1 1 1 1 1
symmnumber: 1
zpe: 971834.0 jmol-1
zpe.correction: 0.370152 hartree
zpe.thermalcorrener: 0.394355 hartree
zpe.thermalcorrenthalpy: 0.395299 hartree
zpe.thermalcorrgfe: 0.314373 hartree
zpe.sumelectzpe: -1107.778461 hartree
zpe.sumelectthermal: -1107.754258 hartree
zpe.sumelectthermalent: -1107.753314 hartree
zpe.sumelectthermalfe: -1107.834240 hartree
dipole: 1.0678 4.9937 -0.9186
dipole: 5.1885
quadrupole: -133.7724 -146.4700 -148.8932
quadrupole: 7.5364 -0.7572 -4.3884
quadrupole: 9.2728 -3.4248 -5.8480 7.5364 -0.7572 -4.3884
hfenergy: -1108.148613 hartree
pointgroup: C01 [X(C18H22N2O4)]
dipole: -0.4083165 1.973995 0.3218559 debye
polarizability: 254.8511087|-14.0381124|225.8956386|12.0754768|4.7174037|172.1628454 unknown
InChI: InChI=1S/C18H22N2O4/c1-4-18(11-10-12(2)3)15(22)19-17(24)20(16(18)23)14(21)13-8-6-5-7-9-13/h5-9,12,19H,4,10-11H2,1-3H3
charge 0 multiplicity 1
46 atoms
O  0.526333 -0.323165 -1.735312
O  3.601531 -1.67437 1.728152
O  -0.909476 -2.747103 1.971217
O  -1.7375 -2.728069 -1.136719
N  -0.19447 -1.461689 0.145791
N  1.345104 -2.164825 1.814654
C  2.157653 -0.538186 0.090783
C  2.105317 0.889891 0.79278
C  1.9424 2.095481 -0.157445
C  3.299526 -0.60433 -0.964264
C  1.791553 3.44785 0.596222
C  0.801676 -0.771235 -0.592162
C  2.452814 -1.512618 1.242665
C  3.479335 -1.996117 -1.605498
C  0.450317 3.548444 1.364497
C  1.921903 4.621892 -0.403515
C  0.014422 -2.162515 1.355539
C  -1.535664 -1.662394 -0.526375
C  -2.496094 -0.546081 -0.388911
C  -2.224312 0.593922 0.412587
C  -3.735174 -0.643222 -1.081763
C  -3.179724 1.624116 0.520023
C  -4.685377 0.388623 -0.973604
C  -4.409695 1.524199 -0.172162
H  1.286484 0.883088 1.540107
H  3.053356 0.988674 1.356876
H  2.830135 2.161583 -0.814865
H  1.068562 1.953715 -0.822459
H  4.234654 -0.29919 -0.46007
H  3.073901 0.133337 -1.752702
H  2.619758 3.528875 1.332976
H  3.745961 -2.760001 -0.853186
H  2.563538 -2.319364 -2.132936
H  4.294933 -1.966887 -2.349727
H  1.517251 -2.7291 2.653807
H  0.346632 2.764465 2.137881
H  -0.401393 3.45773 0.661931
H  0.36448 4.525525 1.874667
H  1.125599 4.570465 -1.170808
H  1.833807 5.596803 0.110732
H  2.896256 4.59956 -0.925978
H  -1.276467 0.670056 0.954187
H  -3.925947 -1.531183 -1.693087
H  -2.970312 2.500667 1.142206
H  -5.637943 0.313708 -1.508268
H  -5.151243 2.326273 -0.087267
